program: Gaussian 09
title: 000224053
version: EM64L-G09RevD.01
frameworkgroup: C1[X(C15H16N2)]
method: RPBEPBE
basis: SDD
operation: Freq
keyword: #pfreq=noraman
keyword: PBEPBE/SDD
title: #p freq=noraman PBEPBE/SDD
converged: YES YES NO NO
title: Mulliken charges:
elementType: N N C C C C C C C C C C C C C C C H H H H H H H H H H H H H H H H
charge: -0.250846 -0.696363 0.293114 -0.695038 0.264554 0.286511 0.145185 -0.588712 0.243030 -0.641687 0.411397 -0.425979 -0.386733 -0.237872 -0.241643 -0.620399 -0.620258 0.238941 0.238971 0.261965 0.224422 0.238798 0.233934 0.222502 0.222364 0.216797 0.241354 0.178424 0.241293 0.217033 0.178075 0.300425 0.306442
chargesum: 0.00000
title: Mulliken charges with hydrogens summed into heavy atoms:
elementType: N N C C C C C C C C C C C C C C C
charge: -0.250846 -0.089497 0.293114 -0.217127 0.264554 0.286511 0.145185 -0.326747 0.243030 -0.417266 0.411397 -0.187181 -0.152798 -0.015370 -0.019278 0.016175 0.016143
polarizability: 2.89994404e+02 3.47703596e+00 1.77011412e+02 -4.16606738e-02 6.04732414e-02 9.05261887e+01
1716.lowfreq: -6.6119 0.0006 0.0006 0.0007 4.3763 14.8270 23.6283 50.4473 101.3125
frequency: 23.2282 50.4264 101.3071 103.7932 143.4124 151.1444 174.1301 187.5920 204.6316 259.7450 261.0538 273.4589 289.8020 323.2157 386.8391 389.1327 396.0621 411.2530 438.0115 482.9212 491.4581 520.6347 553.5118 576.7902 621.1901 663.5100 681.3689 728.3478 729.2137 753.7645 774.3092 802.8290 816.4614 863.9845 868.0454 898.8789 900.7734 938.5838 968.4573 978.9977 982.6255 1021.1032 1029.8280 1047.6690 1088.6912 1095.0384 1102.0315 1128.1295 1128.3429 1166.8890 1179.6705 1180.3956 1196.3325 1221.2768 1227.7943 1253.6077 1267.1395 1299.7737 1340.5056 1375.8366 1404.9709 1421.7042 1427.1241 1431.8866 1441.3280 1448.5799 1463.2696 1471.7253 1477.8076 1478.2685 1491.7066 1502.8824 1574.7145 1589.4054 1619.2149 1623.8548 1637.7903 2832.5859 2844.2649 2974.5416 2989.5069 2991.8314 3016.1694 3079.1264 3082.6661 3111.4749 3117.6493 3124.9336 3138.7395 3138.8528 3158.1020 3576.1124 3720.0700
redmass: 2.5729 4.0820 3.9542 1.9616 3.6749 1.4482 1.1350 3.4637 2.6636 3.1449 3.9382 4.0489 2.7158 1.1940 1.5753 3.6783 4.0212 1.6772 2.5783 4.2957 3.5427 3.4824 5.4632 3.6787 6.0808 4.2406 5.5211 6.2719 1.8498 2.9010 1.8986 4.4786 3.8745 1.5758 1.5167 1.4856 4.4404 1.4566 1.8566 3.2510 1.3330 2.0462 1.5447 1.4574 2.1446 1.2161 1.8269 1.3534 1.1403 1.1578 1.5019 3.3525 1.8198 5.3871 1.9191 1.5451 2.5527 1.8365 3.8317 7.4941 4.0169 1.1150 1.9675 1.2147 1.4591 2.5995 1.0551 1.2085 1.0568 2.3190 3.3609 1.3197 7.8731 6.5701 5.5355 1.5396 3.4426 1.0586 1.0603 1.0605 1.0724 1.0744 1.0995 1.0966 1.0972 1.0912 1.0851 1.0893 1.0945 1.0923 1.1002 1.0446 1.1037
irintensity: 0.3172 0.2061 1.7669 2.7626 0.0170 1.7273 5.9041 1.5212 3.3823 0.4424 0.0033 9.5253 3.6076 259.9997 7.7922 2.4973 0.8191 3.0964 1.4157 1.0375 4.4471 0.5375 0.9246 1.8584 12.2043 0.0907 2.7257 1.4354 30.5587 15.2485 54.3848 4.9994 0.5944 25.2367 4.3506 2.7593 27.6042 0.7727 12.0060 3.8221 0.3489 4.3655 18.9303 12.1044 25.2568 6.1971 29.4830 1.5567 0.0402 1.3315 5.5878 12.9619 14.8247 29.6722 7.4204 24.5295 2.0497 0.2820 8.1495 67.6938 27.4161 5.2207 3.0738 17.3608 21.7265 27.5050 4.3963 13.5610 21.5801 68.6468 83.9214 5.5940 19.1332 2.9998 3.6939 53.4843 171.4710 91.2523 244.3584 25.6471 129.3008 14.9176 11.1249 16.5568 42.1839 17.5295 5.7830 3.0723 39.4638 8.4243 42.5920 56.5048 24.9043
temp: 298.150 k
press: 1.00000 atm
elementType: 7 7 6 6 6 6 6 6 6 6 6 6 6 6 6 6 6 1 1 1 1 1 1 1 1 1 1 1 1 1 1 1 1
symmnumber: 1
zpe: 711286.5 jmol-1
zpe.correction: 0.270915 hartree
zpe.thermalcorrener: 0.286548 hartree
zpe.thermalcorrenthalpy: 0.287492 hartree
zpe.thermalcorrgfe: 0.228023 hartree
zpe.sumelectzpe: -689.491979 hartree
zpe.sumelectthermal: -689.476346 hartree
zpe.sumelectthermalent: -689.475402 hartree
zpe.sumelectthermalfe: -689.534871 hartree
dipole: 1.9166 1.1764 0.0129
dipole: 2.2489
quadrupole: -86.0847 -86.4977 -105.5907
quadrupole: 5.8347 0.0245 0.0147
quadrupole: 6.6397 6.2267 -12.8663 5.8347 0.0245 0.0147
hfenergy: -689.762894 hartree
pointgroup: C01 [X(C15H16N2)]
dipole: 0.7532059 0.4526981 0.1028882 debye
polarizability: 289.9734756|3.3347166|173.52427|2.0188068|17.0419018|94.0342585 unknown
InChI: InChI=1S/C15H16N2/c1-17(2)15-8-11-7-10-5-3-4-6-12(10)13(11)9-14(15)16/h3-6,8-9H,7,16H2,1-2H3
charge 0 multiplicity 1
33 atoms
N  3.702194 -0.634337 -0.094524
N  2.81235 2.064951 0.453422
C  -0.040118 -1.006533 -0.198323
C  -1.250853 -1.913042 -0.391316
C  -0.462428 0.330013 0.073061
C  -2.422626 -0.954002 -0.202433
C  -1.938059 0.362902 0.070861
C  1.332186 -1.300588 -0.249786
C  2.299175 -0.287872 -0.035157
C  0.474636 1.35814 0.290046
C  1.865683 1.059126 0.238669
C  -3.80403 -1.207021 -0.26319
C  -2.842018 1.427798 0.283904
C  -4.710805 -0.137308 -0.049446
C  -4.231373 1.168769 0.221911
C  4.450986 -0.750063 1.164371
C  4.476816 -0.238812 -1.278681
H  -1.277909 -2.740083 0.346189
H  -1.266978 -2.385235 -1.393997
H  1.701578 -2.311475 -0.455371
H  0.146073 2.38434 0.498736
H  -4.181617 -2.214989 -0.472242
H  -2.479075 2.440618 0.494091
H  -5.790484 -0.320465 -0.093804
H  -4.945323 1.984289 0.384975
H  5.317092 -1.426383 1.022295
H  3.800535 -1.185176 1.941708
H  4.852282 0.216823 1.564438
H  3.842142 -0.316222 -2.177483
H  5.338562 -0.923549 -1.406027
H  4.888521 0.803109 -1.24683
H  2.52082 3.017807 0.647351
H  3.803866 1.854667 0.42048
