program: Gaussian 09
title: 000224052
version: EM64L-G09RevD.01
frameworkgroup: C1[X(C15H14N2O2)]
method: RPBEPBE
basis: SDD
operation: Freq
keyword: #p
keyword: freq=noraman
keyword: PBEPBE/SDD
title: #p freq=noraman PBEPBE/SDD
converged: YES YES NO NO
title: Mulliken charges:
elementType: O O N N C C C C C C C C C C C C C C C H H H H H H H H H H H H H H
charge: -0.227118 -0.234929 -0.135487 -0.001513 0.318481 -0.700485 0.254550 0.278344 0.169567 -0.585237 0.358200 -0.575678 0.222538 -0.424711 -0.383907 -0.235453 -0.235560 -0.657507 -0.667528 0.248614 0.247542 0.257120 0.290177 0.240731 0.244157 0.226344 0.227747 0.281697 0.248150 0.222306 0.249607 0.250144 0.229098
chargesum: 0.00000
title: Mulliken charges with hydrogens summed into heavy atoms:
elementType: O O N N C C C C C C C C C C C C C C C
charge: -0.227118 -0.234929 -0.135487 -0.001513 0.318481 -0.204329 0.254550 0.278344 0.169567 -0.328118 0.358200 -0.285501 0.222538 -0.183980 -0.139750 -0.009109 -0.007813 0.094646 0.061322
polarizability: 3.29347623e+02 5.39661832e+00 2.10437464e+02 1.90422100e+00 3.64472331e+00 8.91633469e+01
1716.lowfreq: -2.9336 0.0006 0.0008 0.0009 6.8691 8.9428 48.7854 63.9349 73.5077
frequency: 48.7635 63.9282 73.5041 107.7842 127.9874 150.4662 172.0548 204.7400 228.6062 241.9739 252.0273 260.1321 265.3587 316.9586 327.7161 369.8772 389.9053 431.1916 434.2740 470.1108 478.2474 510.6454 561.3284 580.5692 611.0428 618.1519 660.9832 686.2985 688.8278 725.2892 732.6623 739.3581 774.0229 789.0131 820.8866 849.8229 872.4757 893.9347 920.5705 937.0405 966.6337 986.8638 993.9892 1022.0287 1050.9917 1061.3915 1091.5398 1100.9875 1118.6828 1134.4276 1138.3583 1169.5485 1177.0104 1186.4860 1193.0088 1206.1084 1219.5942 1248.9086 1266.8191 1305.1455 1326.6426 1352.5330 1375.2150 1388.2659 1425.5681 1431.2838 1434.8126 1443.3717 1462.0534 1463.5228 1471.5561 1477.6948 1485.2619 1488.5314 1518.5043 1573.3729 1592.6493 1621.8211 1640.1976 2944.5743 2970.9563 2983.0609 3027.3194 3051.7875 3057.5083 3084.0138 3098.6642 3122.4457 3130.4810 3143.9207 3158.2087 3162.4867 3171.6350
redmass: 4.7055 4.0544 5.7986 3.7735 5.7076 3.4609 3.0005 1.5366 1.7011 1.8333 3.0021 3.0166 3.2752 7.6450 4.1329 4.2824 4.2324 2.9166 3.1420 3.8416 4.1204 3.3705 5.1341 6.4260 4.9891 6.0840 5.0290 5.3700 6.2562 5.3861 2.3819 3.6729 1.8884 5.8217 4.2221 1.4595 1.3398 5.0445 1.5142 1.6004 1.8631 1.3278 3.0480 2.1503 5.1908 1.5213 1.2307 2.0304 1.3847 1.1907 1.6050 1.1589 2.8914 1.6386 8.5927 1.9222 2.7573 2.0279 1.9759 1.5885 9.4153 3.7716 5.8882 4.1904 1.1888 1.2199 1.4365 2.5347 2.2195 1.1680 1.5270 1.5464 1.2496 1.1345 2.3389 7.9591 6.6187 7.2814 7.9393 1.0455 1.0342 1.0608 1.0994 1.0877 1.1004 1.1008 1.1013 1.0859 1.0891 1.0946 1.0903 1.1003 1.0919
irintensity: 1.3458 1.1434 0.0807 2.4863 0.9455 1.2603 1.0369 0.5258 2.7456 1.0825 12.3986 4.7171 1.6087 0.5314 4.0470 1.4814 6.3110 4.8699 4.3949 0.4983 0.6015 0.4539 3.0262 7.3344 3.0482 5.4584 4.8965 7.2406 5.7291 8.8306 30.7726 5.1822 56.0579 4.2576 2.9844 11.1752 3.8110 11.6554 9.9710 6.2833 14.7599 0.0671 19.2799 19.0535 2.2237 15.4331 5.2966 0.8889 4.2058 3.7289 21.6135 1.8395 24.1720 13.9603 388.0306 35.8537 33.3273 1.3961 12.5360 2.4412 114.5788 12.2977 5.6117 14.3529 26.3805 28.6857 47.2591 18.5262 41.1089 15.9266 12.9225 8.9687 2.4300 6.3329 188.7934 74.2269 5.2242 3.3203 137.7893 90.3832 69.4569 14.2677 6.8669 31.6916 16.0012 13.8961 19.1937 4.9075 4.2107 27.3392 10.4744 37.3136 3.8289
temp: 298.150 k
press: 1.00000 atm
elementType: 8 8 7 7 6 6 6 6 6 6 6 6 6 6 6 6 6 6 6 1 1 1 1 1 1 1 1 1 1 1 1 1 1
symmnumber: 1
zpe: 676530.0 jmol-1
zpe.correction: 0.257677 hartree
zpe.thermalcorrener: 0.273709 hartree
zpe.thermalcorrenthalpy: 0.274653 hartree
zpe.thermalcorrgfe: 0.214586 hartree
zpe.sumelectzpe: -838.525797 hartree
zpe.sumelectthermal: -838.509764 hartree
zpe.sumelectthermalent: -838.508820 hartree
zpe.sumelectthermalfe: -838.568887 hartree
dipole: 0.9993 -6.2846 1.1561
dipole: 6.4678
quadrupole: -99.2833 -107.2084 -115.0556
quadrupole: 17.4664 -6.3986 2.2061
quadrupole: 7.8991 -0.0260 -7.8731 17.4664 -6.3986 2.2061
hfenergy: -838.7834732 hartree
pointgroup: C01 [X(C15H14N2O2)]
dipole: -0.4172178 -2.5090277 0.0758117 debye
polarizability: 329.2132997|-6.9119599|203.923575|-3.454132|-27.6628293|95.8115594 unknown
InChI: InChI=1S/C15H14N2O2/c1-16(2)14-8-11-7-10-5-3-4-6-12(10)13(11)9-15(14)17(18)19/h3-6,8-9H,7H2,1-2H3
charge 0 multiplicity 1
33 atoms
O  2.299551 2.923323 -0.855122
O  3.691357 1.70584 0.482602
N  3.269603 -1.138124 -0.031179
N  2.600629 1.83196 -0.215594
C  -0.429665 -1.098115 0.332032
C  -1.707343 -1.886787 0.600219
C  -0.761399 0.241729 -0.060714
C  -2.805446 -0.86439 0.316094
C  -2.227083 0.384946 -0.067414
C  0.893831 -1.527296 0.391624
C  1.977354 -0.634428 0.070813
C  0.26457 1.154686 -0.322675
C  1.619163 0.740611 -0.205156
C  -4.200938 -1.012713 0.388479
C  -3.04957 1.490521 -0.378467
C  -5.026589 0.097717 0.077115
C  -4.453352 1.337348 -0.302493
C  4.2942 -0.555258 -0.91072
C  3.622512 -2.421713 0.597312
H  -1.745679 -2.255441 1.644201
H  -1.78955 -2.777814 -0.052551
H  1.114508 -2.572184 0.626827
H  0.071651 2.202736 -0.566745
H  -4.650945 -1.968455 0.681506
H  -2.613439 2.451269 -0.674299
H  -6.116507 -0.00157 0.130211
H  -5.106199 2.184798 -0.539654
H  4.991363 0.102466 -0.359201
H  3.822203 0.04748 -1.70534
H  4.856165 -1.376095 -1.39307
H  3.13608 -2.523182 1.581995
H  4.712774 -2.447386 0.760363
H  3.346286 -3.29518 -0.030801
