program: Gaussian 09
title: 000224047
version: EM64L-G09RevD.01
frameworkgroup: C1[X(C17H19N)]
method: RPBEPBE
basis: SDD
operation: Freq
keyword: #pfreq=noraman
keyword: PBEPBE/SDD
title: #p freq=noraman PBEPBE/SDD
converged: YES YES NO NO
title: Mulliken charges:
elementType: N C C C C C C C C C C C C C C C C C H H H H H H H H H H H H H H H H H H H
charge: -0.171503 0.309809 -0.705059 0.183731 0.271146 0.185345 0.483059 -0.616752 -0.429885 -0.391455 -0.395900 -0.395450 -0.427534 -0.404384 -0.245631 -0.236688 -0.664307 -0.665694 0.239943 0.239625 0.240356 0.232010 0.224828 0.219209 0.224418 0.220685 0.225294 0.236199 0.234260 0.220741 0.220240 0.240562 0.215541 0.212613 0.241821 0.216274 0.212534
chargesum: 0.00000
title: Mulliken charges with hydrogens summed into heavy atoms:
elementType: N C C C C C C C C C C C C C C C C C
charge: -0.171503 0.309809 -0.225491 0.183731 0.271146 0.185345 0.483059 -0.376396 -0.197874 -0.166627 0.047726 0.050528 -0.191335 -0.170124 -0.024890 -0.016448 0.004409 0.004934
polarizability: 3.45226729e+02 -2.27863147e-01 1.88429277e+02 3.75936723e-01 1.13572619e+01 1.01400927e+02
1716.lowfreq: -8.0892 -4.7244 -0.0003 -0.0002 0.0003 3.6007 41.1681 46.6928 81.6359
frequency: 41.1568 46.5382 81.6345 88.7359 94.8844 141.0375 155.5104 188.2780 208.1052 214.9494 236.5460 255.7165 297.1161 322.5597 348.6201 401.2235 423.3331 432.5983 464.5884 487.9856 512.2075 537.1588 545.0044 561.2961 595.4655 640.6004 678.4456 706.9644 737.2895 739.7193 771.0011 783.3896 785.4855 810.3929 813.8706 840.6323 842.7122 865.7371 918.3298 926.5349 934.1368 940.9098 963.5335 978.1092 989.5642 1018.0805 1026.2777 1071.9426 1076.3825 1093.8144 1095.0435 1125.5010 1130.3456 1148.3256 1166.3220 1181.5957 1191.6113 1201.7278 1205.3007 1244.8625 1273.4766 1288.0344 1302.6439 1310.1326 1341.3528 1351.4836 1368.8951 1384.2706 1386.2171 1388.8740 1395.8067 1427.8427 1446.2499 1463.5943 1464.2997 1467.5501 1467.9665 1476.5980 1482.3190 1491.4066 1496.1469 1513.2334 1578.7328 1589.8171 1619.1649 1634.9923 2978.7669 2981.2367 2981.2764 2983.0856 2989.2843 3022.7270 3032.1980 3037.9757 3076.4060 3076.8181 3090.5779 3091.7797 3115.6011 3122.4044 3124.6199 3137.7271 3145.7528 3157.4228 3163.2005
redmass: 3.7599 3.5648 3.2060 2.8629 3.9463 3.1096 2.9137 2.7014 1.0558 1.4865 2.1253 3.2485 2.8688 3.6686 3.3063 3.4868 2.7585 2.8252 2.8497 3.4986 3.4128 4.2629 3.5139 4.3545 2.9308 6.2611 4.8582 2.8868 1.6347 5.1558 2.0287 1.2516 1.2183 1.6015 3.2331 2.7256 1.5437 1.3594 2.1740 1.5862 2.4313 1.3810 1.9218 1.3265 5.6437 2.6860 2.2612 2.1514 1.8041 2.0559 1.7083 1.9629 1.1478 1.6245 1.1431 1.5546 2.1633 1.7800 2.5032 1.6414 1.5330 1.2339 1.4829 1.9370 1.2805 1.3478 5.2337 1.2695 1.2918 2.5755 2.2918 1.1498 2.6542 1.8082 2.1133 1.4091 1.0809 1.1908 1.0767 1.1082 2.0581 1.5216 6.9557 6.5055 7.2590 7.2001 1.0605 1.0367 1.0362 1.0592 1.0604 1.0995 1.1028 1.1023 1.0995 1.0994 1.1010 1.1008 1.0854 1.0890 1.0890 1.0942 1.0901 1.1001 1.0931
irintensity: 0.8499 0.2447 0.2821 0.0429 0.4525 0.5465 0.7800 0.2901 0.4563 0.2956 10.4533 0.2778 0.2134 0.8323 0.8860 7.1977 8.4247 0.1115 0.2867 2.1736 0.4944 2.8040 5.7228 6.0929 0.7926 1.7195 0.8282 0.2460 53.0014 1.2328 62.0204 10.8585 11.1860 22.2338 3.1040 3.8592 13.3047 2.8041 3.4823 0.6509 1.2937 0.1930 11.9905 0.1529 3.2324 7.6983 34.3522 13.7306 20.7606 22.6307 13.0222 49.2860 0.1192 2.3275 0.0620 0.1017 5.3379 1.0980 50.6303 24.0984 92.1120 3.2005 5.3877 13.8954 18.7527 121.4627 11.3799 1.3935 38.9934 39.6476 22.8000 14.6837 18.6415 14.6362 143.8855 5.1654 4.7438 11.2101 3.0009 30.5033 49.1983 93.8338 38.2112 2.6118 59.3166 300.2906 18.3304 44.2498 24.1765 48.3778 67.5732 9.8991 6.5845 19.0364 33.4113 60.6280 2.7357 94.6184 7.5705 12.3896 3.9420 36.3381 21.8475 48.8667 26.5278
temp: 298.150 k
press: 1.00000 atm
elementType: 7 6 6 6 6 6 6 6 6 6 6 6 6 6 6 6 6 6 1 1 1 1 1 1 1 1 1 1 1 1 1 1 1 1 1 1 1
symmnumber: 1
zpe: 819721.3 jmol-1
zpe.correction: 0.312215 hartree
zpe.thermalcorrener: 0.328445 hartree
zpe.thermalcorrenthalpy: 0.329389 hartree
zpe.thermalcorrgfe: 0.268495 hartree
zpe.sumelectzpe: -712.678730 hartree
zpe.sumelectthermal: -712.662501 hartree
zpe.sumelectthermalent: -712.661556 hartree
zpe.sumelectthermalfe: -712.722450 hartree
dipole: -3.5789 0.8074 0.1386
dipole: 3.6715
quadrupole: -92.0863 -96.3732 -113.4372
quadrupole: 0.5956 0.2241 3.6023
quadrupole: 8.5459 4.2590 -12.8050 0.5956 0.2241 3.6023
hfenergy: -712.9909452 hartree
pointgroup: C01 [X(C17H19N1)]
dipole: 1.4082955 -0.3178188 0.0469475 debye
polarizability: 345.227389|-0.022933|189.1086541|0.2192708|-8.3297062|100.7208897 unknown
InChI: InChI=1S/C17H19N/c1-3-18(4-2)15-9-10-17-14(12-15)11-13-7-5-6-8-16(13)17/h5-10,12H,3-4,11H2,1-2H3
charge 0 multiplicity 1
37 atoms
N  3.340613 -0.050129 0.001455
C  -0.336943 -0.746536 0.119041
C  -1.465064 -1.764845 0.270428
C  -0.886316 0.555713 -0.0777
C  -2.721073 -0.905783 0.143626
C  -2.354696 0.46208 -0.060615
C  1.949365 0.139327 -0.02363
C  1.046032 -0.964525 0.141985
C  -0.009696 1.649362 -0.248088
C  1.382979 1.445654 -0.216432
C  4.277638 1.047443 -0.302496
C  3.937508 -1.354232 0.34441
C  -4.072373 -1.284399 0.200816
C  -3.35428 1.451471 -0.206369
C  -5.074723 -0.290261 0.054006
C  -4.714107 1.065387 -0.147397
C  4.646695 1.91367 0.926812
C  4.111674 -2.30178 -0.867711
H  -1.420695 -2.288014 1.246112
H  -1.421952 -2.548545 -0.511696
H  1.428287 -1.981861 0.269645
H  -0.39839 2.663698 -0.396757
H  2.037827 2.314402 -0.327918
H  5.199481 0.59903 -0.719999
H  3.856072 1.681175 -1.104898
H  4.927167 -1.163573 0.802178
H  3.328783 -1.844011 1.127594
H  -4.356279 -2.332246 0.356838
H  -3.086274 2.502785 -0.363103
H  -6.133108 -0.571342 0.096726
H  -5.498958 1.822652 -0.258793
H  3.750143 2.385628 1.364531
H  5.120356 1.296135 1.711612
H  5.358044 2.711351 0.641412
H  3.140724 -2.51652 -1.346544
H  4.770004 -1.846095 -1.629652
H  4.565035 -3.259965 -0.551031
