program: Gaussian 09
title: 000224077
version: EM64L-G09RevD.01
frameworkgroup: C1[X(C20H12N4O6)]
method: RPBEPBE
basis: SDD
operation: Freq
keyword: #p
keyword: freq=noraman
keyword: PBEPBE/SDD
title: #p freq=noraman PBEPBE/SDD
converged: YES YES NO NO
title: Mulliken charges:
elementType: O O O O O O N N N N C C C C C C C C C C C C C C C C C C C C H H H H H H H H H H H H
charge: -0.168945 -0.201772 -0.186049 -0.187015 -0.193698 -0.199521 0.036092 0.010605 0.017027 0.021691 0.143965 0.299847 0.241395 0.281175 -0.443420 0.323575 -0.627536 -0.340355 -0.535669 0.467142 -0.541759 0.394590 -0.413245 0.262504 -0.367078 -0.353718 0.435761 -0.386220 -0.339013 -0.801139 0.345070 0.318783 0.341954 0.329947 0.296392 0.260456 0.269421 0.240777 0.240823 0.243342 0.228656 0.235161
chargesum: 0.00000
title: Mulliken charges with hydrogens summed into heavy atoms:
elementType: O O O O O O N N N N C C C C C C C C C C C C C C C C C C C C
charge: -0.168945 -0.201772 -0.186049 -0.187015 -0.193698 -0.199521 0.036092 0.010605 0.017027 0.021691 0.143965 0.299847 0.241395 0.281175 -0.443420 0.323575 -0.282466 -0.021572 -0.193716 0.467142 -0.211812 0.394590 -0.116853 0.262504 -0.106622 -0.084297 0.435761 -0.145442 -0.098190 -0.093979
polarizability: 5.46652638e+02 2.77649607e+01 3.90911529e+02 2.36104894e+00 1.26365794e+01 1.29379931e+02
1716.lowfreq: -18.2967 -4.6836 -0.0009 -0.0008 -0.0005 1.8544 4.2975 21.2459 29.9681
frequency: -18.2317 21.2304 29.9632 38.4810 44.3453 48.0125 52.5943 60.7134 74.2505 105.2542 110.9340 125.7432 154.3919 164.5394 181.6581 195.6110 212.4909 223.1155 234.9689 273.5430 314.1041 330.5125 337.7947 344.6273 370.2120 385.5812 408.8218 417.3170 438.3518 454.1385 483.0887 492.4351 519.6630 529.1171 532.8577 544.7260 550.5757 589.9918 619.5197 632.0902 656.1025 666.5596 677.5810 694.7744 708.5302 711.6780 719.0746 722.4705 727.5224 748.6048 779.7448 795.7860 800.9497 817.8256 831.1757 841.6660 874.4941 883.8133 887.0642 948.1455 957.1502 966.2249 977.1247 980.3420 985.5034 987.5606 1004.0929 1004.7997 1013.8686 1044.8844 1064.3713 1080.3401 1116.6286 1122.2360 1145.8301 1165.3553 1185.9961 1203.9064 1207.4454 1210.9963 1218.6513 1226.0656 1243.5586 1263.3246 1281.0605 1303.1317 1353.2396 1357.2111 1370.7641 1380.0004 1396.0802 1398.7884 1398.8954 1418.8042 1429.1679 1439.1200 1446.2589 1467.0509 1471.0328 1473.9483 1491.3147 1553.4179 1572.4387 1578.6432 1585.3519 1604.8451 1613.8307 1626.2600 2979.3035 3056.8899 3091.9543 3126.9850 3135.6892 3150.5951 3166.3356 3182.9144 3186.8026 3190.1846 3192.1314 3211.8212
redmass: 1.0238 9.4622 5.2217 8.4710 11.8313 10.3680 11.1044 5.7670 5.7413 11.1245 6.4014 7.7487 5.4720 8.5072 6.6548 6.6234 7.3576 7.5017 10.1133 5.8196 5.1301 10.7954 4.3653 6.3634 7.8051 4.4011 3.2040 4.6007 7.5938 4.5134 6.6813 5.6763 7.3200 6.2860 3.7095 5.8250 4.1404 7.5245 6.5692 7.1327 6.0683 9.1181 8.1134 6.6376 4.8511 4.5941 5.2937 6.4575 8.7511 7.7021 7.3444 4.5222 5.5326 4.5760 1.5895 1.3398 1.5683 7.8519 8.4031 1.3965 1.4674 1.3632 1.4658 1.4572 5.0381 1.5144 1.6305 2.1736 4.6370 1.5674 2.0489 1.7261 2.9212 1.3023 2.1645 2.1576 1.2459 8.4345 7.7213 3.7724 4.3832 2.8606 3.0974 2.8505 1.7826 1.3335 4.1794 5.0246 11.0705 12.5298 7.4710 4.8436 1.3841 3.6775 2.8997 4.5108 5.0627 1.0561 1.2059 3.7214 2.9219 5.7324 8.2500 8.5618 8.1371 7.3628 8.5595 8.0482 1.0380 1.0967 1.0988 1.0878 1.0892 1.0964 1.0964 1.0913 1.0931 1.0921 1.0929 1.0944
irintensity: 0.5042 0.2373 1.0600 0.6468 0.1130 0.3464 0.2492 3.0232 2.7878 1.5641 1.3202 1.6546 5.7530 3.9026 0.5803 0.9322 0.5852 5.5960 0.4936 2.3775 0.1485 2.7747 0.5890 2.6874 2.7082 8.1295 13.4905 4.1207 13.5357 9.4793 3.8624 4.1601 0.2991 1.5391 10.1944 3.1549 0.3294 5.4078 3.4113 0.6801 9.6956 19.5285 25.0418 0.4113 29.8253 6.2883 2.3922 10.5564 21.5065 10.2478 29.2227 6.7369 15.1387 28.4131 48.8737 9.8954 30.8349 13.7925 11.7956 7.5113 17.4770 1.1508 13.0867 15.6798 1.8842 7.4741 1.2165 4.1871 4.7173 11.8260 2.2777 117.4395 0.3459 13.2805 24.4605 22.4712 34.5365 405.7309 474.4693 70.5911 189.8531 9.0122 3.5634 4.1371 50.8531 0.2990 2.2707 57.0486 20.5341 134.8636 148.6888 5.8664 22.5103 1.6406 24.3610 69.0198 1.3315 14.6229 12.1873 75.9442 79.2701 11.5362 59.1255 15.7659 107.7385 20.9136 81.0569 2.7858 24.9341 17.3113 22.0102 10.0098 21.9145 8.0310 10.2225 3.8996 9.7924 33.1560 5.5587 5.2884
temp: 298.150 k
press: 1.00000 atm
elementType: 8 8 8 8 8 8 7 7 7 7 6 6 6 6 6 6 6 6 6 6 6 6 6 6 6 6 6 6 6 6 1 1 1 1 1 1 1 1 1 1 1 1
symmnumber: 1
zpe: 754840.3 jmol-1
zpe.correction: 0.287504 hartree
zpe.thermalcorrener: 0.311478 hartree
zpe.thermalcorrenthalpy: 0.312422 hartree
zpe.thermalcorrgfe: 0.231202 hartree
zpe.sumelectzpe: -1437.372813 hartree
zpe.sumelectthermal: -1437.348838 hartree
zpe.sumelectthermalent: -1437.347894 hartree
zpe.sumelectthermalfe: -1437.429114 hartree
dipole: -4.9959 -1.9068 0.4032
dipole: 5.3626
quadrupole: -193.3477 -196.8207 -166.1962
quadrupole: 30.6103 -5.1753 4.2994
quadrupole: -7.8928 -11.3659 19.2587 30.6103 -5.1753 4.2994
hfenergy: -1437.6603162 hartree
pointgroup: C01 [X(C20H12N4O6)]
dipole: -1.9068438 0.8984117 -0.0901358 debye
polarizability: 541.9559698|-38.4149344|391.5320202|-3.0621605|35.0578194|133.4561077 unknown
InChI: InChI=1S/C20H12N4O6/c1-11-2-4-12(5-3-11)21-20-16-8-13(22(25)26)6-7-15(16)19-17(20)9-14(23(27)28)10-18(19)24(29)30/h2-10H,1H3
charge 0 multiplicity 1
42 atoms
O  5.062666 -2.365978 -0.915492
O  3.332634 -3.417444 0.122567
O  4.056242 3.654693 0.475145
O  5.819562 2.231251 0.195571
O  -3.370254 -4.765457 -0.214629
O  -4.302726 -2.691986 -0.020624
N  -0.732197 1.65267 0.366626
N  3.916311 -2.359211 -0.328313
N  4.558193 2.48179 0.288938
N  -3.285737 -3.482228 -0.11553
C  1.840223 -0.873019 -0.023654
C  0.638581 -1.745378 -0.097798
C  1.376052 0.473777 0.16477
C  -0.535294 -0.909866 0.008036
C  -0.110072 0.511293 0.177976
C  3.24958 -1.045029 -0.12982
C  2.227294 1.578839 0.27572
C  0.489189 -3.146377 -0.231167
C  -1.823347 -1.472666 0.021722
C  3.61265 1.340448 0.172857
C  4.133716 0.052951 -0.04545
C  -1.929916 -2.872356 -0.114344
C  -0.801976 -3.71126 -0.253605
C  -2.106573 1.924573 0.236116
C  -2.68002 2.841359 1.163344
C  -2.912288 1.449395 -0.843607
C  -4.852492 2.714661 0.006287
C  -4.037103 3.200028 1.06348
C  -4.253818 1.852348 -0.954799
C  -6.310924 3.110143 -0.110919
H  1.827977 2.584422 0.42799
H  1.36195 -3.794769 -0.292361
H  -2.729082 -0.874619 0.134256
H  5.211409 -0.097421 -0.146703
H  -0.947922 -4.789185 -0.359706
H  -2.045303 3.243231 1.959119
H  -2.466866 0.81179 -1.615214
H  -4.468296 3.882417 1.804796
H  -4.851969 1.492289 -1.800262
H  -6.972385 2.236209 0.043722
H  -6.586554 3.874929 0.634446
H  -6.540314 3.513141 -1.114688
