program: Gaussian 09
title: 000217861
version: EM64L-G09RevD.01
frameworkgroup: C1[X(C16H23N3)]
method: RPBEPBE
basis: SDD
operation: Freq
keyword: #pfreq=noraman
keyword: PBEPBE/SDD
title: #p freq=noraman PBEPBE/SDD
converged: YES YES NO NO
title: Mulliken charges:
elementType: N N N C C C C C C C C C C C C C C C C H H H H H H H H H H H H H H H H H H H H H H H
charge: -0.228679 -0.103352 -0.021402 0.202518 0.123229 -0.490322 -0.512559 -0.409244 -0.411340 0.140679 0.256076 -0.406048 -0.427640 -0.310601 -0.504167 -0.339956 -0.358375 -0.626945 -0.607856 0.217900 0.224416 0.219574 0.214916 0.209621 0.206658 0.208056 0.206631 0.259457 0.214831 0.211616 0.233897 0.236484 0.198352 0.201453 0.245338 0.232197 0.236905 0.193927 0.224815 0.223852 0.190906 0.224185
chargesum: 0.00000
title: Mulliken charges with hydrogens summed into heavy atoms:
elementType: N N N C C C C C C C C C C C C C C C C
charge: -0.228679 -0.103352 -0.021402 0.202518 0.123229 -0.048005 -0.078070 0.007035 0.003347 0.140679 0.256076 0.068239 0.017873 -0.074117 -0.258828 0.059849 -0.126178 0.028702 0.031087
polarizability: 2.24991353e+02 -5.61821563e+00 2.29071947e+02 9.72107041e+00 3.14253695e+00 1.21297256e+02
1716.lowfreq: -8.3992 -0.0005 -0.0005 0.0006 4.9270 8.3015 19.2296 35.4523 41.8107
frequency: 18.5161 35.3913 41.7864 67.3254 81.0512 92.1907 130.0869 168.8026 185.7071 214.0400 220.5930 230.1000 257.6376 274.7400 295.1552 297.1392 310.1233 364.3876 371.7161 382.6644 420.9183 424.7986 459.4235 495.4187 518.2008 561.0359 590.3231 604.3540 640.9116 666.4606 705.2012 731.8295 768.4929 784.4319 805.1826 809.7276 825.1486 834.0387 866.4911 880.7856 905.1801 912.1406 936.3965 959.7430 960.6617 972.1783 1025.0762 1034.4903 1046.3848 1057.8647 1070.9391 1078.7091 1080.3655 1092.6157 1094.6104 1131.6787 1136.1328 1144.7273 1162.6275 1177.3473 1193.8017 1215.6879 1236.5018 1242.8243 1249.6850 1262.7962 1270.8736 1290.3850 1303.8910 1315.0125 1319.6190 1334.9537 1339.0243 1343.6500 1356.6062 1363.2787 1367.4103 1372.6154 1414.2452 1419.3868 1427.0956 1442.1007 1457.3934 1459.7513 1462.3078 1464.9499 1465.9609 1472.8646 1473.9434 1474.8665 1477.1934 1481.0001 1486.4581 1495.4956 1548.7945 1584.1635 1604.3940 2846.2094 2855.1332 2870.4180 2947.7834 2954.9104 2979.6256 2981.4005 2996.0438 3002.1010 3005.7186 3009.2148 3011.9216 3020.8347 3030.0573 3043.3420 3047.4742 3051.1714 3074.5105 3079.1221 3085.8466 3117.0426 3127.5362 3152.6007
redmass: 3.7902 3.4258 2.8813 3.2618 3.2322 3.4891 2.9686 2.7718 2.9376 1.4180 1.3544 2.6528 1.7649 2.4576 1.7971 2.2814 3.0583 2.0327 4.6473 3.7780 2.2791 2.6352 2.7414 3.3755 3.6548 4.1864 4.6003 4.2413 4.6261 3.0441 4.7398 1.8916 4.6620 3.1380 2.0639 1.3921 1.4866 2.8359 2.1950 2.1478 1.4269 1.4700 1.4145 3.7811 2.4587 2.1552 2.1053 1.5315 3.1578 2.3249 1.8480 1.8611 1.9581 1.7012 1.7272 1.1622 1.4751 1.5909 1.6972 1.7441 2.9749 1.7159 1.3133 1.8476 1.3515 1.9606 1.7533 1.2647 1.5523 1.2809 1.3596 1.7613 1.4313 1.9499 1.5678 1.6206 1.8188 2.2682 3.6947 1.1495 2.8244 1.1605 1.1356 1.0751 1.0859 1.2387 1.1897 1.1167 1.8755 1.1799 1.0639 1.0670 1.0537 1.1079 6.8866 7.3722 7.4573 1.0686 1.0572 1.0579 1.0622 1.0645 1.0652 1.0668 1.0622 1.0898 1.0842 1.0645 1.0938 1.0729 1.0728 1.0987 1.0984 1.1043 1.1045 1.1011 1.1006 1.0907 1.0880 1.0975
irintensity: 0.1059 0.0349 0.6609 0.0362 0.0663 0.6781 0.3311 1.5631 0.5435 0.3705 0.2847 0.4061 0.7921 0.8686 0.6378 7.6837 4.6965 3.9898 4.1110 1.4491 0.4355 2.7262 1.5938 8.5992 0.2380 0.6284 4.2162 6.0988 0.6097 5.3406 0.4034 14.1159 4.4754 5.4267 13.2565 37.8169 7.3295 2.1367 4.2998 8.5060 2.2561 1.8598 0.3501 9.5383 1.9474 20.5973 7.8116 18.1865 4.9570 3.7641 13.1803 1.2800 11.5534 1.7876 4.9580 3.7853 5.9448 8.7104 7.8927 17.2698 6.9298 5.5042 12.2689 24.0748 10.0933 4.8987 7.5506 5.3821 8.4391 3.0828 7.9947 15.2546 4.2665 3.9593 17.9096 5.3610 9.2501 15.3283 40.6934 2.3197 12.4741 2.7377 2.9516 2.2929 14.9435 8.2807 28.0966 4.9095 53.4495 16.1961 13.6583 11.6211 11.7618 23.9857 7.2330 0.7248 20.5448 50.7037 66.8234 279.5069 44.1619 41.4959 34.8167 18.5763 15.6681 56.4578 11.0330 42.8025 31.7478 42.1687 31.3671 78.9137 17.3033 61.4084 20.8733 37.6868 43.4758 27.3836 8.2089 30.1999
temp: 298.150 k
press: 1.00000 atm
elementType: 7 7 7 6 6 6 6 6 6 6 6 6 6 6 6 6 6 6 6 1 1 1 1 1 1 1 1 1 1 1 1 1 1 1 1 1 1 1 1 1 1 1
symmnumber: 1
zpe: 952186.8 jmol-1
zpe.correction: 0.362669 hartree
zpe.thermalcorrener: 0.380882 hartree
zpe.thermalcorrenthalpy: 0.381826 hartree
zpe.thermalcorrgfe: 0.315130 hartree
zpe.sumelectzpe: -786.312186 hartree
zpe.sumelectthermal: -786.293972 hartree
zpe.sumelectthermalent: -786.293028 hartree
zpe.sumelectthermalfe: -786.359725 hartree
dipole: -3.1693 -5.7562 0.1906
dipole: 6.5737
quadrupole: -100.8961 -126.5980 -117.2964
quadrupole: -10.1603 0.0004 0.0099
quadrupole: 14.0340 -11.6678 -2.3662 -10.1603 0.0004 0.0099
hfenergy: -786.6748544 hartree
pointgroup: C01[X(C16H23N3)]
dipole: 1.4398522 2.1456055 0.1105108 debye
polarizability: 224.21046|-5.059155|230.05866|-9.0989211|-1.1713533|121.0914361 unknown
InChI: InChI=1S/C16H23N3/c1-18(2)10-5-11-19-15-7-4-3-6-13(15)14-12-17-9-8-16(14)19/h8-9,12H,3-7,10-11H2,1-2H3
charge 0 multiplicity 1
42 atoms
N  -0.0386 0.339653 -0.366932
N  4.277516 0.104378 -0.101378
N  -1.773062 -3.46351 0.048456
C  -1.183884 1.152018 -0.183916
C  -2.30558 0.3492 0.028956
C  -1.181027 2.656076 -0.243089
C  -3.6920 0.914346 0.233916
C  -2.520923 3.195902 0.330165
C  -3.738316 2.40235 -0.207367
C  -1.851078 -1.025173 -0.005209
C  -0.428676 -0.996648 -0.251581
C  1.3462 0.804869 -0.531375
C  2.094506 0.980739 0.812546
C  0.310574 -2.195959 -0.342907
C  -2.467893 -2.294969 0.134139
C  3.602245 1.230737 0.592274
C  -0.416814 -3.395047 -0.185346
C  4.423284 -1.095047 0.75123
C  5.570558 0.507343 -0.693815
H  -0.330551 3.082908 0.326014
H  -1.058709 3.001304 -1.291935
H  -4.440715 0.329601 -0.33575
H  -3.98729 0.834466 1.301289
H  -2.500106 3.119897 1.435456
H  -2.622192 4.268596 0.07888
H  -3.743949 2.456494 -1.31455
H  -4.677303 2.869354 0.145512
H  1.903202 0.077276 -1.147866
H  1.335673 1.760357 -1.087431
H  1.669269 1.832119 1.378975
H  1.935119 0.08097 1.435327
H  1.388507 -2.217081 -0.533432
H  4.085725 1.457662 1.577445
H  3.72813 2.133155 -0.038587
H  -3.544804 -2.388339 0.319889
H  0.096413 -4.36146 -0.247055
H  3.437287 -1.447861 1.098682
H  5.061622 -0.913019 1.65301
H  4.884074 -1.90977 0.164843
H  5.994342 -0.336746 -1.266935
H  6.330057 0.820344 0.066957
H  5.416868 1.350011 -1.391205
