program: Gaussian 09
title: 000217857
version: EM64L-G09RevD.01
frameworkgroup: C1[X(C18H18N2)]
method: RPBEPBE
basis: SDD
operation: Freq
keyword: #pfreq=noraman
keyword: PBEPBE/SDD
title: #p freq=noraman PBEPBE/SDD
converged: YES YES NO NO
title: Mulliken charges:
elementType: N N C C C C C C C C C C C C C C C C C C H H H H H H H H H H H H H H H H H H
charge: -0.256699 -0.018316 0.199775 0.124628 -0.475715 -0.512298 -0.409712 -0.412154 0.141633 0.288511 -0.580924 -0.503568 -0.308696 0.494552 -0.358570 -0.432197 -0.382247 -0.218246 -0.224736 -0.243177 0.213321 0.240103 0.219753 0.216321 0.210179 0.207962 0.209183 0.207271 0.238438 0.234125 0.247428 0.229234 0.234281 0.229249 0.260777 0.228419 0.230693 0.231417
chargesum: 0.00000
title: Mulliken charges with hydrogens summed into heavy atoms:
elementType: N N C C C C C C C C C C C C C C C C C C
charge: -0.256699 -0.018316 0.199775 0.124628 -0.022291 -0.076223 0.008430 0.004300 0.141633 0.288511 -0.108361 -0.256140 -0.079462 0.494552 -0.124289 -0.202947 -0.121470 0.010174 0.005957 -0.011760
polarizability: 2.41318787e+02 -2.39992959e+01 2.05967852e+02 1.64889015e+01 -3.69513820e+00 1.51792164e+02
1716.lowfreq: -9.8115 -4.5984 -0.0001 0.0004 0.0005 5.4092 17.9598 22.6145 38.3754
frequency: 17.6590 22.4661 38.3430 76.7678 117.7136 148.2785 167.2946 181.4536 191.1948 251.3914 282.4770 304.2878 308.8852 345.3184 391.8805 402.6640 420.7785 452.1040 462.9828 516.3874 552.2211 560.5890 592.3628 614.2555 624.0503 632.2149 658.3401 701.6053 707.7914 743.9468 764.9509 795.4600 800.8198 805.0965 823.0683 828.9772 855.3245 859.3604 903.2459 911.2598 912.3651 935.3353 959.6718 961.9324 979.1667 989.9069 995.2141 1006.1749 1025.3856 1027.3588 1050.1066 1079.1612 1087.6123 1094.5532 1132.7963 1151.4599 1169.3278 1173.1494 1187.7270 1189.9079 1204.8402 1211.7882 1236.7470 1248.5455 1263.4548 1300.0802 1306.9465 1319.1728 1334.3097 1337.4722 1343.2001 1349.0576 1362.8897 1371.2907 1387.8381 1411.8085 1426.5329 1442.0873 1456.2606 1464.0181 1465.7040 1469.8087 1474.1814 1474.8387 1485.7465 1548.0239 1585.6147 1595.7685 1605.4301 1615.1746 2956.2169 2957.5327 2979.3122 2982.4300 2990.9616 3004.6714 3012.5108 3039.3268 3043.6816 3051.9023 3111.6904 3118.6418 3126.8843 3128.1909 3137.7735 3148.5574 3151.6297 3165.1090
redmass: 4.5619 3.9667 4.5505 3.1091 2.8370 4.0371 4.0729 3.6156 4.1840 3.4262 2.0494 2.6047 3.0253 3.5155 4.7470 2.8241 2.7899 2.8318 2.8304 3.8874 5.2968 4.3521 4.8664 5.7582 4.9973 3.9630 3.7346 3.2991 2.4640 1.6456 4.4086 3.9452 3.1029 1.5353 1.5132 3.0540 1.2607 2.2598 1.4372 1.4486 1.4090 1.4327 3.8773 2.4510 1.3872 6.1589 1.4843 1.9005 2.2604 2.0899 3.3205 1.8563 1.6170 1.8688 1.1500 1.5205 2.0598 1.0553 1.4889 1.7190 2.0503 2.0091 1.2993 1.3367 1.4938 1.5936 1.4387 1.3762 1.7100 1.4838 1.9285 1.4177 2.3659 3.0044 4.4484 3.4715 2.8003 2.1538 1.1336 1.3225 1.1755 1.1825 1.7199 1.3073 2.0324 6.8818 7.4424 6.1510 7.3727 5.9725 1.0641 1.0598 1.0649 1.0666 1.0597 1.0933 1.0941 1.1014 1.0988 1.1041 1.0881 1.0908 1.0860 1.0877 1.0911 1.0959 1.0978 1.1015
irintensity: 0.7577 0.0695 0.1412 0.1581 0.3212 0.8910 1.3507 1.3465 1.3180 1.5673 1.2370 0.7371 4.0911 1.0070 2.7931 0.2176 2.8099 6.1343 1.8582 1.6864 5.5685 2.9233 7.2877 0.5901 1.0434 4.6754 8.8155 10.6050 28.7499 51.6232 3.6106 1.8347 14.0490 39.5485 5.8929 0.8209 0.5183 12.8316 2.4422 1.9737 1.7537 0.3403 9.5765 3.2595 0.1588 0.3748 1.0725 2.7922 15.5770 1.3481 4.4215 0.3356 5.7073 1.8403 4.1675 3.5225 14.8338 0.1126 2.0336 7.2420 13.0157 5.2932 3.0091 1.0647 24.3904 3.7884 18.6785 3.1154 12.7102 6.8352 8.8587 13.2528 1.0895 40.4754 2.2671 29.7499 19.1632 15.3731 2.9525 27.9310 30.5254 12.4062 48.7504 17.7296 16.5102 7.2851 0.5231 1.0451 29.6298 5.7273 47.9039 33.0793 31.2300 23.7729 27.9510 41.6121 27.5802 8.4772 74.3654 58.0013 9.7062 25.1620 1.1973 7.6696 11.3453 33.7612 29.1890 23.7946
temp: 298.150 k
press: 1.00000 atm
elementType: 7 7 6 6 6 6 6 6 6 6 6 6 6 6 6 6 6 6 6 6 1 1 1 1 1 1 1 1 1 1 1 1 1 1 1 1 1 1
symmnumber: 1
zpe: 826315.9 jmol-1
zpe.correction: 0.314727 hartree
zpe.thermalcorrener: 0.330879 hartree
zpe.thermalcorrenthalpy: 0.331823 hartree
zpe.thermalcorrgfe: 0.269066 hartree
zpe.sumelectzpe: -804.819559 hartree
zpe.sumelectthermal: -804.803407 hartree
zpe.sumelectthermalent: -804.802463 hartree
zpe.sumelectthermalfe: -804.865219 hartree
dipole: -4.5868 3.1577 -1.4179
dipole: 5.7463
quadrupole: -123.8089 -118.5193 -112.3276
quadrupole: 12.4503 0.1952 2.4720
quadrupole: -5.5903 -0.3007 5.8910 12.4503 0.1952 2.4720
hfenergy: -805.1342857 hartree
pointgroup: C01 [X(C18H18N2)]
dipole: -1.4890607 1.6652655 -0.3474747 debye
polarizability: 228.9313781|-31.3779554|218.0200824|13.2957613|2.6091279|152.127343 unknown
InChI: InChI=1S/C18H18N2/c1-2-6-14(7-3-1)13-20-17-9-5-4-8-15(17)16-12-19-11-10-18(16)20/h1-3,6-7,10-12H,4-5,8-9,13H2
charge 0 multiplicity 1
38 atoms
N  0.195333 -0.107179 -0.889774
N  2.906462 -3.193058 0.002426
C  0.880813 0.993497 -0.315525
C  2.080035 0.558177 0.247777
C  0.377068 2.410946 -0.323595
C  3.044467 1.491563 0.94182
C  1.537387 3.3715 0.057899
C  2.349964 2.841689 1.26665
C  2.159237 -0.870277 0.023408
C  0.963563 -1.25898 -0.685461
C  -1.109051 -0.048843 -1.558234
C  3.096621 -1.887351 0.339329
C  0.746238 -2.607345 -1.041737
C  -2.297408 0.153657 -0.614203
C  1.752352 -3.525731 -0.671822
C  -3.437931 0.864472 -1.061582
C  -2.295196 -0.394356 0.692152
C  -4.564804 1.018006 -0.222328
C  -3.419351 -0.238792 1.53365
C  -4.558868 0.465296 1.079029
H  -0.029563 2.689717 -1.316954
H  -0.461833 2.524931 0.393967
H  3.429577 1.032613 1.873533
H  3.9316 1.674737 0.299995
H  2.216206 3.487194 -0.810198
H  1.124218 4.372314 0.284549
H  1.667115 2.705855 2.129247
H  3.107716 3.589703 1.567348
H  -1.233132 -0.996967 -2.114459
H  -1.098611 0.75727 -2.316464
H  4.025889 -1.658791 0.874953
H  -0.148399 -2.951394 -1.570869
H  1.643635 -4.587736 -0.918908
H  -3.446153 1.301381 -2.068691
H  -1.412144 -0.935207 1.050854
H  -5.440649 1.571033 -0.579898
H  -3.406429 -0.666673 2.542353
H  -5.430076 0.585325 1.732464
