program: Gaussian 09
title: 000217844
version: EM64L-G09RevD.01
frameworkgroup: C1[X(C10H16N2O2)]
method: RPBEPBE
basis: SDD
operation: Freq
keyword: #p
keyword: freq=noraman
keyword: PBEPBE/SDD
title: #p freq=noraman PBEPBE/SDD
converged: YES YES NO NO
title: Mulliken charges:
elementType: O O N N C C C C C C C C C C H H H H H H H H H H H H H H H H
charge: -0.195942 -0.195471 -0.102025 -0.196501 -0.367371 -0.375523 -0.329355 -0.329281 -0.671795 -0.672349 0.184626 0.174613 -0.259480 -0.255578 0.214341 0.234424 0.255521 0.239047 0.204997 0.190352 0.216366 0.191904 0.220730 0.226326 0.205782 0.207603 0.226689 0.209152 0.274112 0.274085
chargesum: 0.00000
title: Mulliken charges with hydrogens summed into heavy atoms:
elementType: O O N N C C C C C C C C C C
charge: -0.195942 -0.195471 -0.102025 -0.196501 0.081393 0.119045 0.065995 0.078989 -0.018957 -0.028905 0.184626 0.174613 0.014631 0.018507
polarizability: 1.43263756e+02 -8.14325997e-03 1.48815453e+02 6.57293999e+00 4.03711847e+00 8.47896360e+01
1716.lowfreq: -0.0008 -0.0008 -0.0008 4.6490 6.1283 10.5233 21.1230 31.0200 56.3694
frequency: 18.9054 30.9242 56.3191 60.1272 88.8936 90.7772 138.3480 164.1082 205.2050 243.5783 247.6802 279.4845 294.9081 299.4969 316.7766 389.1572 399.8025 448.2850 487.3375 546.6816 604.5468 626.7707 689.2335 722.0556 736.5248 762.9821 772.9444 796.5619 802.4874 820.5191 908.8152 937.4958 950.0580 990.6609 1022.4107 1043.1870 1067.1538 1075.1036 1078.9219 1085.6675 1100.2843 1122.8696 1135.3895 1209.5361 1213.3255 1272.6782 1282.1291 1287.3291 1291.8247 1317.3034 1330.0754 1359.5543 1363.4439 1371.2574 1385.8921 1388.4294 1389.5199 1448.8775 1461.9254 1464.5203 1472.8331 1480.8944 1487.0221 1488.3013 1493.0157 1579.5783 1618.4519 1674.0636 2856.5739 2864.2954 2898.6504 2983.0624 2984.7217 3022.1252 3033.6319 3035.9747 3050.3777 3076.0868 3077.7656 3091.8057 3092.0926 3102.7863 3204.1715 3233.0224
redmass: 5.3847 4.3453 3.0265 3.1523 3.0971 2.0478 7.9780 1.6096 1.3747 1.6407 2.3269 2.0825 4.2357 2.8849 3.2405 3.9404 3.8566 2.7783 2.8858 3.8979 6.9558 2.4374 7.5050 4.0480 6.3837 1.7253 1.6357 1.1399 1.3178 2.0976 2.0389 1.3106 2.3289 2.2762 1.9234 2.8774 2.1518 2.4836 2.1442 2.0132 2.4479 2.2531 1.7629 2.3465 2.5503 1.2965 1.6535 1.2314 1.2580 1.2431 1.4629 3.3466 1.3378 1.3674 1.3845 1.2539 1.2492 1.1077 1.0534 1.0536 1.0547 1.0518 1.0730 1.0709 1.0772 6.9285 11.3253 10.6351 1.0718 1.0714 1.0705 1.0357 1.0356 1.0878 1.0597 1.0874 1.0891 1.0986 1.0980 1.1004 1.1004 1.1062 1.0894 1.1106
irintensity: 0.1270 0.1931 0.4478 0.8368 1.8583 0.2084 9.9528 0.4933 1.0060 0.5338 2.0632 2.4679 0.0249 4.3563 6.0876 7.2533 12.3001 8.0361 6.1466 0.0726 11.0502 1.7847 33.9565 2.7509 0.6602 14.6042 13.1119 4.5394 4.9747 71.2299 1.1698 0.0114 6.9606 3.3471 17.8735 5.6695 3.1420 20.1752 34.9996 3.8496 78.2086 0.1325 14.2451 22.1466 12.1624 11.4868 0.4712 27.0510 25.6879 6.9652 28.9407 172.3706 0.9488 23.4007 44.2710 14.1847 23.4594 21.6664 2.2359 5.0117 1.0624 3.7119 16.2758 12.0088 11.2031 5.4097 440.4936 0.6332 31.9914 153.6520 93.8752 29.1243 29.9050 14.7734 16.8711 16.5786 13.3907 30.4624 77.8446 26.6955 55.8321 4.8729 0.0239 1.3749
temp: 298.150 k
press: 1.00000 atm
elementType: 8 8 7 7 6 6 6 6 6 6 6 6 6 6 1 1 1 1 1 1 1 1 1 1 1 1 1 1 1 1
symmnumber: 1
zpe: 654347.5 jmol-1
zpe.correction: 0.249228 hartree
zpe.thermalcorrener: 0.264473 hartree
zpe.thermalcorrenthalpy: 0.265418 hartree
zpe.thermalcorrgfe: 0.204634 hartree
zpe.sumelectzpe: -649.507550 hartree
zpe.sumelectthermal: -649.492304 hartree
zpe.sumelectthermalent: -649.491360 hartree
zpe.sumelectthermalfe: -649.552144 hartree
dipole: -0.4910 -0.0134 -1.2477
dipole: 1.3409
quadrupole: -68.3369 -97.5384 -84.7189
quadrupole: -1.2354 0.9521 -2.1349
quadrupole: 15.1945 -14.0070 -1.1875 -1.2354 0.9521 -2.1349
hfenergy: -649.7567779 hartree
pointgroup: C01 [X(C10H16N2O2)]
dipole: -0.1965977 0.1396661 0.4691967 debye
polarizability: 143.3547478|-1.6194355|146.2501072|-5.8933983|-13.2181322|87.2639894 unknown
InChI: InChI=1S/C10H16N2O2/c1-3-11(4-2)7-8-12-9(13)5-6-10(12)14/h5-6H,3-4,7-8H2,1-2H3
charge 0 multiplicity 1
30 atoms
O  -1.767619 -2.297641 0.195913
O  -1.845551 2.333943 -0.58033
N  2.338356 0.032882 0.148506
N  -1.431955 0.005893 -0.301849
C  0.922654 -0.032152 0.57166
C  -0.00713 -0.032365 -0.668559
C  3.245695 -0.833042 0.946642
C  2.827671 1.428389 -0.019379
C  3.082018 -2.329026 0.616314
C  3.985453 1.546766 -1.028858
C  -2.194217 -1.118984 0.106169
C  -2.232565 1.177904 -0.276561
C  -3.584152 -0.603219 0.394925
C  -3.606039 0.73929 0.173025
H  0.641977 0.816485 1.239856
H  0.74796 -0.963448 1.138552
H  0.185426 -0.941316 -1.262699
H  0.194126 0.852536 -1.296602
H  4.283681 -0.532687 0.715384
H  3.106572 -0.669384 2.045309
H  1.980336 2.040262 -0.382499
H  3.134519 1.87118 0.962124
H  2.057637 -2.688023 0.82425
H  3.291972 -2.505809 -0.452864
H  3.779618 -2.937807 1.221517
H  4.877699 0.981115 -0.704415
H  3.673469 1.154278 -2.012316
H  4.285923 2.604613 -1.146909
H  -4.386049 -1.263845 0.724824
H  -4.430284 1.445111 0.276675
