program: Gaussian 09
title: 000224014
version: EM64L-G09RevD.01
frameworkgroup: C1[X(C8H13N3O2)]
method: RPBEPBE
basis: SDD
operation: Freq
keyword: #p
keyword: freq=noraman
keyword: PBEPBE/SDD
title: #p freq=noraman PBEPBE/SDD
converged: YES YES NO NO
title: Mulliken charges:
elementType: O O N N N C C C C C C C C H H H H H H H H H H H H H
charge: -0.178950 -0.209889 -0.447536 -0.018491 -0.648672 -0.406388 -0.355791 -0.250081 -0.346889 0.237938 -0.694908 -0.201154 0.284141 0.218557 0.254910 0.209626 0.211637 0.290923 0.195454 0.202629 0.213892 0.220037 0.210809 0.333437 0.321233 0.353524
chargesum: 0.00000
title: Mulliken charges with hydrogens summed into heavy atoms:
elementType: O O N N N C C C C C C C C
charge: -0.178950 -0.209889 -0.114099 -0.018491 0.026085 0.067079 0.065472 0.040843 0.051195 0.237938 -0.050171 -0.201154 0.284141
polarizability: 1.19278302e+02 -6.00854600e+00 1.04810490e+02 1.04866356e+01 1.43851421e+01 1.06486893e+02
1716.lowfreq: -26.0597 -11.4870 -7.8348 0.0008 0.0009 0.0010 13.9277 23.8752 33.4329
frequency: -2.3222 23.8164 31.1839 49.6675 95.1568 105.4717 112.8492 127.2553 175.2092 206.3263 217.4754 267.7702 312.8614 370.9911 381.3169 386.0750 407.0802 487.8948 532.2900 553.2027 570.4379 620.9854 667.8970 722.4648 728.2969 754.3762 788.3773 845.0265 889.3699 904.0163 905.7750 965.3552 992.9900 1058.5157 1058.8737 1091.1991 1100.6359 1134.3280 1169.5558 1199.4604 1218.8062 1257.8800 1279.6261 1290.9917 1298.1718 1302.8350 1337.5569 1359.5913 1388.6066 1452.6777 1459.4916 1465.7562 1474.2059 1476.2505 1485.6437 1615.4221 1653.9164 1707.7356 2170.1179 2963.4015 2972.0667 2975.3938 2991.4256 3003.8610 3006.7365 3031.3689 3068.0586 3073.4893 3076.4131 3479.9790 3531.7327 3685.6370
redmass: 3.7033 4.4462 2.0609 4.2730 5.3513 7.6388 2.8489 3.6752 4.8574 4.1896 1.1657 2.8509 7.9826 3.6004 2.3588 2.2731 2.3223 4.6091 7.0999 1.3149 3.8551 4.2442 1.1631 5.1457 1.2060 2.4472 1.7089 3.2131 3.9263 1.8096 1.9867 2.0740 2.7278 2.0413 2.6833 2.8296 2.2049 1.6394 2.3546 1.5671 1.3543 1.3478 1.2785 1.1408 3.3858 1.2064 1.3979 1.5523 1.2136 1.1152 1.8730 1.0738 1.0639 1.0479 1.0782 1.1724 5.3522 7.4544 12.5238 1.0585 1.0597 1.0360 1.0757 1.0805 1.0834 1.1031 1.1030 1.1018 1.0992 1.0769 1.0462 1.1041
irintensity: 0.4234 17.1121 0.4437 0.7166 7.4793 11.6418 0.3967 0.1576 0.3031 1.2951 0.1026 2.6187 2.5329 2.7661 17.7693 14.9807 25.0184 9.9149 24.7941 230.5296 16.2091 0.4121 83.5631 46.6896 20.0904 11.8981 5.9474 2.6916 15.4019 15.4838 6.6104 1.1079 3.3166 7.7483 0.5755 1.9017 3.4026 20.9719 147.5553 16.6496 6.6279 2.0819 5.6638 1.1979 187.0565 5.3782 1.2934 3.3363 11.0823 77.2106 588.5541 6.8737 6.2954 12.8316 18.5436 48.1867 24.0926 428.2666 19.4770 1.5906 48.9780 33.6979 12.5258 12.2506 15.0443 21.8833 0.5549 87.3492 49.1214 34.6480 50.8270 41.0240
temp: 298.150 k
press: 1.00000 atm
elementType: 8 8 7 7 7 6 6 6 6 6 6 6 6 1 1 1 1 1 1 1 1 1 1 1 1 1
symmnumber: 1
zpe: 547690.4 jmol-1
zpe.correction: 0.208604 hartree
zpe.thermalcorrener: 0.222817 hartree
zpe.thermalcorrenthalpy: 0.223761 hartree
zpe.thermalcorrgfe: 0.165478 hartree
zpe.sumelectzpe: -626.361489 hartree
zpe.sumelectthermal: -626.347277 hartree
zpe.sumelectthermalent: -626.346333 hartree
zpe.sumelectthermalfe: -626.404616 hartree
dipole: -0.9889 1.7106 2.9357
dipole: 3.5387
quadrupole: -71.4835 -91.5664 -76.0885
quadrupole: 7.0132 16.1773 -12.0093
quadrupole: 8.2293 -11.8536 3.6243 7.0132 16.1773 -12.0093
hfenergy: -626.5700936 hartree
pointgroup: C01 [X(C8H13N3O2)]
dipole: -0.3756046 1.0129457 0.878194 debye
dipolederiv: -0.5537452 0.063353 -0.058377 -0.1807698 -0.7953565 -0.3061718 -0.175643 -0.1579784 -0.4733448 -0.6722002 0.2550028 0.0038229 0.3025571 -0.7583264 -0.1802287 -0.0419178 -0.1830516 -0.5243512 -1.7159338 0.1018607 -0.5908228 0.2416661 -0.4584527 0.0107173 -0.6353855 -0.0182554 -0.6723089 -0.2329334 -0.0343182 -0.0150057 0.0260755 -0.3898553 0.0327021 0.0084056 -0.0973362 -0.2235391 -0.7636451 -0.3364225 -0.2533105 -0.3647764 -0.6592328 -0.1075761 -0.2997157 -0.08997 -0.953787 0.2567473 0.0517833 0.0426674 0.0762618 0.0607765 -0.0199249 -0.0187855 -0.0784231 0.0867666 -0.0302129 -0.0885229 0.0264843 -0.1031971 0.1152076 0.0321883 0.0228781 0.0305221 0.0012818 -0.1888689 0.0664578 -0.0271373 0.1443305 -0.1633698 -0.0260056 -0.0526829 -0.0193804 0.0912648 0.1466615 -0.022132 0.0103494 -0.0222371 0.1563288 0.0092361 0.0589653 0.0343827 0.0588497 1.3847236 -0.2034085 0.4178086 0.1693429 1.021987 0.4480001 0.7741087 0.1601116 0.6665899 0.0145325 -0.0396239 0.0517624 -0.0404725 0.0687478 0.0397022 0.0259641 0.0274092 -0.0230534 -0.1758308 0.1174804 0.004037 -0.001098 0.2705037 0.0551074 -0.0566099 0.2431469 -0.001344 1.8289017 -0.2481474 0.6656364 -0.5881519 1.1378835 0.3344756 0.6466753 0.4586246 1.1391498 -0.0895722 0.0738489 -0.0766448 0.0739795 0.0192512 0.0813865 -0.0232735 0.0571013 0.0206311 0.0978813 -0.0273029 0.0139567 -0.0454265 -0.0344878 -0.0892381 0.0253793 -0.0309911 0.0186682 -0.0790604 0.0738544 -0.0665702 0.0965243 0.0049063 0.0535809 -0.0785755 0.0365351 0.0124917 0.0598119 -0.0129246 0.0021513 -0.0244805 -0.0994674 -0.0945569 -0.0080959 -0.0848512 -0.007377 0.0800633 -0.0115423 0.0316809 0.0006427 0.0231843 0.0179034 0.0434834 0.01543 -0.0056297 -0.0842029 0.0685963 -0.0629379 0.1085235 -0.0163658 0.0929634 -0.0810657 0.0725833 -0.0103521 0.0524095 0.0090529 0.0351527 -0.0275307 -0.0977025 -0.1094835 0.00242 -0.1171252 -0.0397025 -0.037665 0.1293539 -0.099391 0.1011706 0.0076739 0.0671368 -0.0428544 0.049834 0.0176772 -0.1412995 -0.1296552 0.0697679 -0.1306279 0.032127 0.0399052 0.0504252 0.0285643 0.0509515 0.1020868 -0.0038899 -0.0079375 0.0218313 -0.1052899 -0.1402036 0.015832 -0.0802082 -0.0128021 0.2562151 -0.0221232 -0.0510379 -0.000059 0.1795251 -0.0622586 -0.0808607 -0.0716517 0.2207198 0.2262249 0.0959624 -0.0296019 0.1144876 0.2336305 -0.0858801 -0.0284319 -0.108966 0.2720272 0.2589112 0.0734065 -0.0365033 0.051434 0.2461735 -0.0934776 -0.0506389 -0.0760567 0.2905224 unknown
polarizability: 121.4890959|-0.2989769|114.4294941|8.6450888|12.1385826|94.6570946 unknown
InChI: InChI=1S/C8H13N3O2/c1-2-3-4-6(5-9)7(12)11-8(10)13/h6,11H,2-4,10H2,1H3
charge 0 multiplicity 1
26 atoms
O  0.782838 -1.837698 -1.923902
O  3.477651 -1.80777 -0.76713
N  1.793441 -0.122419 -0.656021
N  -0.184384 2.667005 -0.604911
N  3.672311 -0.039802 0.740188
C  -1.749119 -0.396989 -1.573003
C  -2.045103 -0.673043 -0.084208
C  -0.377978 0.307393 -1.832237
C  -3.399965 -1.39129 0.113265
C  0.799806 -0.671275 -1.472384
C  -3.708438 -1.683239 1.597259
C  -0.288906 1.617157 -1.166861
C  3.024346 -0.756329 -0.261855
H  -2.551917 0.225252 -2.011929
H  -1.715525 -1.349094 -2.134003
H  -1.238486 -1.30162 0.344866
H  -2.049637 0.279288 0.484418
H  -0.284513 0.475623 -2.924849
H  -4.210285 -0.76977 -0.319605
H  -3.393733 -2.341102 -0.458429
H  -2.928621 -2.327802 2.044407
H  -4.678916 -2.199234 1.712227
H  -3.750851 -0.747963 2.186482
H  1.639803 0.842033 -0.342729
H  3.261079 0.746789 1.239976
H  4.575403 -0.396701 1.045268
