program: Gaussian 09
title: 000217837
version: EM64L-G09RevD.01
frameworkgroup: C1[X(C18H18Cl2O5)]
method: RPBEPBE
basis: SDD
operation: Freq
keyword: #p
keyword: freq=noraman
keyword: PBEPBE/SDD
title: #p freq=noraman PBEPBE/SDD
converged: YES YES NO NO
title: Mulliken charges:
elementType: Cl Cl O O O O O C C C C C C C C C C C C C C C C C C H H H H H H H H H H H H H H H H H H
charge: -0.052767 -0.056576 -0.314014 -0.286763 -0.267557 -0.434464 -0.190995 -0.153394 -0.294381 -0.322020 -0.112415 0.264097 -0.714494 0.380006 0.380813 -0.333550 -0.361705 -0.328290 -0.376129 -0.206707 -0.182464 -0.163017 -0.184946 -0.128197 -0.155341 0.250810 0.265673 0.256161 0.246154 0.206940 0.235196 0.254390 0.246502 0.217178 0.349695 0.258346 0.259074 0.251506 0.258293 0.256383 0.260747 0.265128 0.257091
chargesum: 0.00000
title: Mulliken charges with hydrogens summed into heavy atoms:
elementType: Cl Cl O O O O O C C C C C C C C C C C C C C C C C C
charge: -0.052767 -0.056576 -0.314014 -0.286763 -0.267557 -0.084768 -0.190995 0.097415 0.227454 0.131074 0.122781 0.264097 0.003576 0.380006 0.380813 -0.075204 -0.102631 -0.076784 -0.117836 0.049676 0.078283 0.102111 0.072145 -0.128197 -0.155341
polarizability: 3.05061584e+02 -3.07183379e+01 2.05448500e+02 -2.88890596e+00 1.28623595e+01 1.61428668e+02
1716.lowfreq: -6.6294 -2.5222 0.0015 0.0021 0.0024 3.8931 11.5912 18.3163 21.7673
frequency: 11.4013 18.2653 21.6944 34.1984 36.9092 46.6454 53.6462 83.5739 93.9119 99.0355 114.3467 129.4350 145.0601 173.9787 201.2546 215.0386 218.9144 236.7543 242.5389 254.6597 276.1957 300.6087 316.3397 320.8187 326.0183 335.2301 382.3701 405.3082 413.4077 415.3688 435.5995 443.9028 484.8019 487.9992 498.0547 502.4660 586.9462 621.4508 622.9310 636.2728 639.2825 685.6234 693.9088 697.2674 707.3263 773.7955 792.8234 799.1202 805.5460 823.6781 824.5395 826.3457 847.2289 884.4059 921.2396 927.8854 931.2136 937.0784 952.9481 954.0054 981.2015 990.8565 992.3518 1002.0253 1030.1998 1065.8748 1072.3684 1074.6345 1080.1653 1090.2494 1108.4662 1110.8631 1135.1281 1141.3769 1173.4849 1177.3574 1185.3935 1208.8578 1219.3309 1230.8623 1245.4522 1289.1876 1291.5402 1313.6031 1323.6482 1334.3064 1351.4560 1364.8730 1371.7663 1375.6926 1385.3109 1390.9908 1402.7170 1404.4787 1448.3762 1460.6559 1466.6896 1472.5525 1473.9641 1481.1301 1583.7294 1585.6732 1603.3630 1603.7652 1667.0999 2971.6805 3003.2662 3006.7394 3034.8583 3041.6306 3071.5998 3105.3602 3111.4494 3118.3401 3155.6123 3156.0181 3159.9487 3161.1678 3174.5636 3175.7480 3180.1774 3181.2686 3541.0329
redmass: 9.5090 12.2195 9.2286 5.5271 6.3370 4.8071 4.9637 7.2453 6.8269 4.9020 6.6791 5.2144 7.9307 3.9263 3.3220 3.0341 1.5690 3.2566 6.2898 3.7151 6.7789 5.6590 6.8261 4.7959 6.0007 6.6118 3.5496 1.1467 3.0167 2.9950 4.3534 4.9303 4.4167 4.2355 2.8657 3.0460 3.5401 6.7602 7.0214 6.6955 8.0267 3.4111 3.5897 3.6669 6.9381 4.5758 6.1603 1.3078 1.3209 1.5822 1.5586 3.0960 4.2433 3.2482 2.7614 1.3437 1.3821 2.6128 1.3456 1.3464 6.3028 3.9832 3.9520 1.9276 2.3185 2.8086 2.6251 2.5878 2.2624 2.3342 1.3109 1.3247 2.0012 2.1464 1.1836 1.2177 1.1261 3.5529 3.4986 1.3542 1.3038 1.2638 1.2780 1.3584 1.2976 1.2922 1.4071 2.7259 6.3021 1.5182 1.6716 1.2235 3.7833 3.5914 1.0813 1.0464 1.5313 2.2927 1.0598 1.4541 7.4367 7.2108 6.8051 6.7064 10.2592 1.0570 1.0399 1.0796 1.0586 1.1024 1.0887 1.0998 1.1082 1.1016 1.0880 1.0883 1.0885 1.0887 1.0967 1.0963 1.0978 1.0978 1.0657
irintensity: 0.1654 0.0620 0.2703 0.6628 0.9878 0.1911 0.0313 1.1293 0.3713 2.0525 0.2505 1.2353 5.4281 1.4860 4.0373 2.7255 4.0394 2.6215 2.1628 3.3758 4.5998 6.5267 3.0557 2.0960 5.9536 5.1192 4.1230 160.4793 0.0344 1.0147 2.4206 4.1204 2.9890 5.3446 22.5656 21.4123 10.3178 1.4687 0.2766 27.9181 50.9413 1.7192 0.4757 3.0269 6.6077 0.5847 2.8592 8.4146 17.3536 94.6430 51.7482 14.7628 13.0327 18.9811 20.9374 0.6300 0.9851 28.6633 0.3067 1.5105 39.3359 3.5807 58.9447 106.5601 42.7907 253.2511 43.8505 63.7116 67.4238 61.4014 10.0461 29.4424 7.1927 9.6597 46.0385 46.5346 10.8946 144.5514 252.0048 6.8089 10.3599 0.2766 2.3477 2.6709 16.1701 8.7738 4.1666 5.6378 4.6245 18.3778 17.9883 31.2059 0.6056 0.2167 22.2197 14.7229 155.3595 176.0117 18.8482 48.0513 6.3176 14.7235 0.4732 31.5843 142.6776 26.2843 11.8596 20.4299 11.0611 26.0877 31.8511 17.0592 11.7363 11.3448 5.6934 6.8582 1.6204 1.3852 2.6844 3.4107 2.7989 0.8898 11.6535
temp: 298.150 k
press: 1.00000 atm
elementType: 17 17 8 8 8 8 8 6 6 6 6 6 6 6 6 6 6 6 6 6 6 6 6 6 6 1 1 1 1 1 1 1 1 1 1 1 1 1 1 1 1 1 1
symmnumber: 1
zpe: 848045.6 jmol-1
zpe.correction: 0.323003 hartree
zpe.thermalcorrener: 0.347910 hartree
zpe.thermalcorrenthalpy: 0.348854 hartree
zpe.thermalcorrgfe: 0.263893 hartree
zpe.sumelectzpe: -1991.084621 hartree
zpe.sumelectthermal: -1991.059715 hartree
zpe.sumelectthermalent: -1991.058771 hartree
zpe.sumelectthermalfe: -1991.143731 hartree
dipole: 3.3925 -1.6007 -2.0858
dipole: 4.2921
quadrupole: -169.4853 -163.6626 -155.8905
quadrupole: 4.1997 -9.3789 -1.4376
quadrupole: -6.4725 -0.6498 7.1223 4.1997 -9.3789 -1.4376
hfenergy: -1991.4076244 hartree
pointgroup: C01 [X(C18H18Cl2O5)]
dipole: -1.3539138 0.6003432 0.8111742 debye
polarizability: 281.8151967|-52.7699977|227.2350404|-10.4483535|-9.7405692|162.888515 unknown
InChI: InChI=1S/C18H18Cl2O5/c1-12(25-17-8-4-14(20)5-9-17)18(22)24-11-15(21)10-23-16-6-2-13(19)3-7-16/h2-9,12,15,21H,10-11H2,1H3
charge 0 multiplicity 1
43 atoms
Cl 3.475351 -4.756585 0.675518
Cl 4.596447 -0.371881 -0.251624
O  -2.615394 1.306873 0.034398
O  -1.765803 -2.016007 -0.500294
O  0.091182 3.623732 0.148663
O  -4.745049 -0.371844 0.985995
O  -1.939587 2.621713 -1.77176
C  -3.808776 -0.792587 -0.065299
C  -3.333436 0.390339 -0.908756
C  -2.653324 -1.575969 0.585899
C  -1.269932 3.241887 0.546581
C  -1.942046 2.391712 -0.549724
C  -2.033325 4.558745 0.737446
C  -0.567902 -2.65916 -0.145095
C  1.080338 2.619176 0.076486
C  -0.204513 -2.98957 1.184072
C  0.299176 -2.971401 -1.221809
C  0.869599 1.251758 0.379249
C  2.359954 3.075009 -0.322822
C  1.032462 -3.631202 1.431059
C  1.530996 -3.607429 -0.975061
C  1.946807 0.339676 0.279618
C  3.432265 2.1677 -0.422004
C  1.883483 -3.930717 0.352926
C  3.210395 0.8079 -0.117821
H  -4.390983 -1.467634 -0.715273
H  -2.636501 0.074366 -1.702152
H  -4.185373 0.937693 -1.346749
H  -3.065005 -2.444859 1.13372
H  -2.099872 -0.924455 1.292844
H  -1.244493 2.657036 1.486437
H  -2.044451 5.126784 -0.20731
H  -1.533529 5.163463 1.511969
H  -3.073278 4.364424 1.053531
H  -4.341452 0.399754 1.462848
H  -0.863156 -2.769147 2.028699
H  0.001036 -2.702466 -2.23919
H  -0.110611 0.872271 0.681595
H  2.495824 4.13504 -0.555289
H  1.321437 -3.891989 2.453247
H  2.208158 -3.841314 -1.801079
H  1.792347 -0.718925 0.507159
H  4.422438 2.512589 -0.732747
