program: Gaussian 09
title: 000223997
version: EM64L-G09RevD.01
frameworkgroup: C1[X(C19H24O3)]
method: RPBEPBE
basis: SDD
operation: Freq
keyword: #pfreq=noraman
keyword: PBEPBE/SDD
title: #p freq=noraman PBEPBE/SDD
converged: YES YES NO NO
title: Mulliken charges:
elementType: O O O C C C C C C C C C C C C C C C C C C C H H H H H H H H H H H H H H H H H H H H H H H H
charge: -0.191767 -0.169087 -0.233984 -0.124038 -0.139842 -0.256045 0.255451 0.205289 -0.471912 -0.646059 -0.537454 0.148097 0.544498 -0.640923 0.062068 -0.508983 -0.487620 -0.778820 -0.803775 -0.563840 -0.584591 0.178224 0.251491 0.227872 0.229972 0.227503 0.217961 0.244997 0.271512 0.239623 0.220679 0.226347 0.238801 0.252844 0.252629 0.203659 0.266354 0.228631 0.250299 0.245061 0.206101 0.274987 0.229433 0.248692 0.234843 0.254823
chargesum: 0.00000
title: Mulliken charges with hydrogens summed into heavy atoms:
elementType: O O O C C C C C C C C C C C C C C C C C C C
charge: -0.191767 -0.169087 -0.233984 0.127452 0.088030 -0.026072 0.255451 0.205289 -0.026449 -0.129550 -0.077152 0.148097 0.544498 -0.175775 0.062068 -0.003509 -0.017607 -0.054829 -0.093254 -0.080305 -0.329768 0.178224
polarizability: 2.64807198e+02 -5.00273963e+00 1.90992579e+02 -7.84115064e+00 -3.18045065e-01 1.51945347e+02
1716.lowfreq: -14.0085 -4.2786 -0.0005 -0.0002 0.0003 9.3983 32.7379 57.6190 64.1754
frequency: 32.6285 57.6140 64.1682 95.7485 119.8799 126.6575 160.7000 174.5521 187.3684 199.5465 205.6066 223.2255 226.7427 244.9694 260.2342 267.4861 277.9982 287.8753 330.6729 355.2144 369.2059 389.8399 394.7475 424.2517 444.3606 486.8099 489.5137 512.5737 526.7500 537.0919 552.1876 563.4739 603.9287 619.3819 642.3018 643.9278 674.2685 725.7991 747.7588 775.7659 798.7088 822.0986 833.4219 844.4693 879.2564 890.5430 903.4696 913.3569 936.0405 940.0279 948.5672 964.6679 984.3381 997.0520 1004.2869 1013.2438 1024.7468 1043.3685 1045.5028 1060.5690 1081.1899 1091.2920 1109.0957 1113.7967 1123.1145 1130.1232 1153.2859 1160.0002 1175.8798 1190.6151 1193.9024 1197.7421 1209.3066 1218.8150 1235.1458 1242.4810 1253.0178 1258.0306 1269.7695 1277.9493 1282.9272 1288.3006 1291.8737 1305.1753 1317.1106 1324.3507 1326.1557 1342.3183 1349.0667 1352.7281 1369.7349 1381.8072 1388.5400 1429.1254 1440.6582 1444.7328 1457.5811 1467.1470 1471.8810 1475.2295 1477.2942 1479.9797 1488.0000 1492.2439 1585.5485 1616.2472 1625.4545 1659.1246 2906.3613 2911.1843 2955.3444 2967.3146 2971.7750 2982.0585 2982.8467 2986.6062 2988.6619 2991.6116 3000.7749 3005.9708 3036.0825 3043.9895 3060.4825 3062.1477 3074.8358 3075.4338 3081.4908 3083.7442 3084.5931 3088.9309 3110.0227 3117.2230
redmass: 7.7244 3.3609 6.0291 3.9873 3.6328 5.9963 2.7461 2.0594 2.6801 1.6708 1.8456 2.3850 1.8056 2.2589 2.6227 3.5244 3.1659 3.4823 3.9047 2.6161 2.7885 3.2329 3.6689 3.3520 2.9046 4.4702 3.3842 3.4181 2.5602 2.5359 2.9180 3.4938 3.5158 3.8711 3.8458 3.5592 3.7981 3.5181 2.7546 2.2492 2.4917 1.7698 2.3040 2.4385 1.8036 1.6699 2.6051 2.1062 2.0619 1.9448 1.8246 1.9459 2.1222 2.4067 2.0282 2.1437 1.8647 2.0070 2.3737 2.8936 1.8275 1.9757 2.3915 2.5472 1.7440 1.6615 2.2101 1.5755 1.8593 1.7877 1.7093 1.5930 2.2337 1.7125 1.6118 1.5612 1.6936 1.4693 1.7089 2.0148 1.3962 1.5565 1.4735 1.4481 1.4209 1.4084 1.5257 1.9904 1.4447 1.3762 1.4977 1.2342 1.1798 1.0795 1.0782 1.0839 1.0861 1.0884 1.0679 1.0764 1.0584 1.0642 1.0749 1.0571 10.0077 9.4476 7.7526 12.1578 1.0803 1.0799 1.0663 1.0629 1.0694 1.0669 1.0713 1.0639 1.0381 1.0397 1.0598 1.0666 1.0985 1.0964 1.0982 1.0949 1.0982 1.1018 1.0937 1.0989 1.0986 1.0990 1.0990 1.0913
irintensity: 3.4108 1.5520 1.0202 6.7180 0.5810 5.0332 0.5097 0.7978 0.1899 0.5825 0.1818 1.9725 0.6823 1.3074 1.5409 1.8116 2.3048 0.0892 2.1524 0.0563 2.4218 1.3555 4.6582 1.2851 5.7263 8.0016 2.1379 6.1505 0.0811 2.0635 1.6318 3.7305 5.2988 0.6999 1.1717 1.5559 11.4321 1.2897 0.1715 8.5346 4.2739 4.2958 6.6498 6.1062 18.3086 8.7963 3.0879 8.1221 11.3082 5.1484 16.0512 4.1694 14.9302 2.8877 0.8405 40.3559 3.9601 19.7259 20.1795 16.9895 3.6287 15.0492 5.2384 4.2656 18.8561 10.3430 21.3895 5.2809 6.5267 10.4225 14.2148 14.7424 18.8533 41.8521 11.0230 33.2225 5.7605 0.2120 12.7207 28.9627 4.8058 9.9214 3.6307 8.4123 0.4403 2.9590 10.2836 5.6449 2.4255 2.4395 2.5625 24.7299 27.4820 18.9773 23.0002 14.4104 18.7293 5.8878 8.1263 2.5929 7.1519 13.9825 10.0538 7.6018 166.4961 117.2140 175.7863 191.2341 3.3577 23.8493 13.0048 23.2293 16.7234 10.3996 20.9558 17.4825 7.8171 41.8262 29.0414 10.8358 46.8778 30.5730 8.7531 22.2772 31.6771 27.7159 10.7560 6.6059 28.2029 17.9006 6.0523 10.9352
temp: 298.150 k
press: 1.00000 atm
elementType: 8 8 8 6 6 6 6 6 6 6 6 6 6 6 6 6 6 6 6 6 6 6 1 1 1 1 1 1 1 1 1 1 1 1 1 1 1 1 1 1 1 1 1 1 1 1
symmnumber: 1
zpe: 1017154.4 jmol-1
zpe.correction: 0.387414 hartree
zpe.thermalcorrener: 0.407386 hartree
zpe.thermalcorrenthalpy: 0.408330 hartree
zpe.thermalcorrgfe: 0.340539 hartree
zpe.sumelectzpe: -962.436364 hartree
zpe.sumelectthermal: -962.416392 hartree
zpe.sumelectthermalent: -962.415447 hartree
zpe.sumelectthermalfe: -962.483239 hartree
dipole: -3.9152 4.1178 1.9969
dipole: 6.0227
quadrupole: -179.5723 -133.6838 -129.5026
quadrupole: -14.6578 2.7662 1.1685
quadrupole: -31.9861 13.9024 18.0837 -14.6578 2.7662 1.1685
hfenergy: -962.8237779 hartree
pointgroup: C01 [X(C19H24O3)]
dipole: -1.5203223 -1.6425578 -0.7779069 debye
polarizability: 264.7127228|6.0603925|191.1501407|7.3692124|-0.2645212|151.8822609 unknown
InChI: InChI=1S/C19H24O3/c1-18-8-7-12(20)9-11(18)3-4-13-14-5-6-16(22)19(14,2)10-15(21)17(13)18/h9,13-14,17H,3-8,10H2,1-2H3
charge 0 multiplicity 1
46 atoms
O  -0.136212 2.673221 -0.459291
O  -5.000058 0.953768 1.02369
O  5.716879 -0.250906 0.973686
C  -0.629783 -0.922992 -0.383337
C  -2.029363 -0.891772 0.260824
C  0.211137 0.294585 0.161855
C  -2.785135 0.441153 -0.008519
C  1.686486 0.365795 -0.393236
C  0.111703 -2.240983 -0.075544
C  -2.009805 1.60394 0.650909
C  -3.071065 -1.991785 -0.080693
C  -0.588882 1.622417 0.068082
C  2.344417 -1.018764 -0.224755
C  1.543295 -2.232579 -0.659472
C  -4.179265 0.123535 0.570752
C  -4.392401 -1.405594 0.496719
C  2.476153 1.427881 0.436863
C  -3.009966 0.7459 -1.523283
C  1.714666 0.728145 -1.914667
C  4.004604 1.349686 0.250921
C  3.628466 -1.171349 0.233328
C  4.540746 -0.049073 0.54046
H  -0.730503 -0.829786 -1.484042
H  -1.872154 -0.941962 1.364532
H  0.296465 0.102867 1.258962
H  -0.451031 -3.096867 -0.494396
H  0.158179 -2.386629 1.023439
H  -1.963419 1.443893 1.746973
H  -2.483253 2.582398 0.465686
H  -2.819823 -2.967513 0.368269
H  -3.145171 -2.1411 -1.174156
H  1.465004 -2.230002 -1.767946
H  2.081236 -3.15778 -0.384608
H  -4.58907 -1.771211 1.523158
H  -5.294938 -1.639746 -0.095749
H  2.247713 1.27301 1.511825
H  2.114319 2.433764 0.168974
H  -3.52083 -0.081846 -2.045875
H  -3.635072 1.650503 -1.624864
H  -2.054571 0.939958 -2.042209
H  1.126956 0.015136 -2.520483
H  1.304984 1.738853 -2.068828
H  2.750738 0.704883 -2.296161
H  4.527036 2.072651 0.902003
H  4.283597 1.609606 -0.790955
H  4.06089 -2.174405 0.347958
