program: Gaussian 09
title: 000223946
version: EM64L-G09RevD.01
frameworkgroup: C1[X(C11H21NO3)]
method: RPBEPBE
basis: SDD
operation: Freq
keyword: #p
keyword: freq=noraman
keyword: PBEPBE/SDD
title: #p freq=noraman PBEPBE/SDD
converged: YES YES NO NO
title: Mulliken charges:
elementType: O O O N C C C C C C C C C C C H H H H H H H H H H H H H H H H H H H H H
charge: -0.254332 -0.291270 -0.249549 -0.619345 -0.138633 -0.420582 -0.349453 -0.401133 -0.355235 0.242403 -0.699424 -0.696876 -0.094335 -0.703621 0.216090 0.235182 0.200979 0.218333 0.191854 0.200131 0.220080 0.206760 0.199614 0.194358 0.227697 0.217478 0.217157 0.210855 0.210843 0.217911 0.252883 0.219134 0.254148 0.224565 0.327494 0.367839
chargesum: 0.00000
title: Mulliken charges with hydrogens summed into heavy atoms:
elementType: O O O N C C C C C C C C C C C
charge: -0.254332 -0.291270 -0.249549 0.075988 0.096549 -0.001269 0.042532 0.025707 0.038737 0.242403 -0.037092 -0.057266 0.158547 -0.005774 0.216090
polarizability: 1.55802707e+02 3.73697082e+00 1.38183420e+02 3.34819520e+00 7.90463009e+00 1.15107954e+02
1716.lowfreq: -20.4409 -7.7389 -2.3107 0.0004 0.0006 0.0010 11.3892 30.4899 50.8423
frequency: 3.0052 30.4121 50.7844 59.0431 63.7665 81.3937 92.4964 117.6258 135.6993 150.7097 173.7852 185.3647 196.3431 219.0262 230.4795 260.5738 291.4309 299.0485 306.5682 315.1447 393.9377 421.2344 471.7272 487.8419 568.6311 611.6387 636.0755 691.4358 703.1029 725.3890 733.2027 777.8824 784.5058 792.6915 817.9732 849.9575 891.7012 911.1976 944.5334 990.7586 1011.1868 1028.1974 1046.3170 1060.7800 1069.0340 1078.4056 1096.1580 1098.3460 1109.9141 1126.1115 1147.6425 1155.6071 1207.8726 1237.6627 1257.4606 1269.1217 1272.9001 1287.3296 1290.6025 1300.6337 1324.4750 1327.7852 1353.5357 1358.3476 1364.5534 1390.9266 1396.6811 1397.8213 1453.5089 1457.3023 1462.3014 1464.4996 1465.2456 1474.6702 1476.1233 1477.6326 1482.2842 1485.9230 1577.0086 1618.4942 1650.5388 2955.8975 2966.6890 2973.1241 2976.6801 2978.3977 2986.2020 2996.4230 3008.2622 3015.1127 3018.2678 3022.2503 3038.4192 3050.0220 3069.5856 3073.2051 3075.6844 3078.6223 3105.7457 3123.3806 3417.7017 3623.9426
redmass: 4.4784 3.9263 2.1664 2.2708 4.2724 3.7103 2.1975 2.6120 5.3531 2.6767 2.0679 1.3968 1.9512 1.1863 1.3407 3.4753 3.9109 4.8404 3.4060 3.7096 3.3255 2.9938 3.1539 3.2363 3.1937 1.4524 2.6223 2.8852 2.5200 1.1295 1.3723 1.4935 1.9880 2.7713 2.1331 2.2278 2.0077 1.4581 1.6306 3.7312 1.6892 1.4868 3.2174 1.6713 2.2594 1.9828 2.1345 2.1890 1.9327 2.6766 2.5872 2.4376 1.4937 1.2717 1.2246 1.4749 1.3345 1.2096 1.0736 1.2519 1.4466 1.3837 1.6241 2.4525 1.6512 1.2173 1.2124 1.2455 1.0783 1.0436 1.0801 1.0582 1.0778 1.0668 1.0427 1.0482 1.0513 1.0801 1.9692 2.4364 5.8281 1.0590 1.0596 1.0363 1.0590 1.0362 1.0601 1.0986 1.0378 1.0896 1.0833 1.0997 1.1027 1.1011 1.1008 1.0992 1.1005 1.0997 1.0995 1.1005 1.0531 1.0983
irintensity: 0.2430 0.6147 0.6632 0.6331 4.5301 1.5717 0.4013 0.1118 2.6779 2.2007 0.4223 0.5296 0.7809 0.8072 0.4348 19.6018 1.4098 5.8969 2.4856 2.7325 0.4084 2.4980 11.2757 9.6466 14.4669 102.3696 0.2462 117.6801 2.7630 90.2501 32.4123 4.9081 1.1518 2.1858 3.5589 10.7599 5.9513 5.6491 24.9146 4.1413 34.5618 1.1407 1.2958 104.6196 10.7265 14.2593 14.8198 6.5881 75.5801 62.5992 76.4762 4.7502 5.0869 4.1530 6.6738 25.9329 16.4580 0.5600 1.2406 4.9410 1.1702 6.3661 13.8878 23.5564 23.3656 8.9935 10.6469 31.5522 0.8667 11.7447 3.5114 9.7930 10.8898 6.4199 12.1059 12.0610 10.1739 17.9560 186.0465 35.5903 307.4800 6.2133 28.0220 36.3102 44.7075 31.3792 48.7684 1.3648 10.1332 7.4765 12.5037 11.6430 4.1350 36.5964 80.5218 53.4925 67.9003 46.4810 18.8937 12.4089 101.7275 68.3363
temp: 298.150 k
press: 1.00000 atm
elementType: 8 8 8 7 6 6 6 6 6 6 6 6 6 6 6 1 1 1 1 1 1 1 1 1 1 1 1 1 1 1 1 1 1 1 1 1
symmnumber: 1
zpe: 811263.6 jmol-1
zpe.correction: 0.308994 hartree
zpe.thermalcorrener: 0.327690 hartree
zpe.thermalcorrenthalpy: 0.328634 hartree
zpe.thermalcorrgfe: 0.258529 hartree
zpe.sumelectzpe: -711.009000 hartree
zpe.sumelectthermal: -710.990305 hartree
zpe.sumelectthermalent: -710.989360 hartree
zpe.sumelectthermalfe: -711.059465 hartree
dipole: 3.0601 1.1804 0.8654
dipole: 3.3921
quadrupole: -103.5629 -87.0661 -94.2052
quadrupole: -5.1268 -9.8021 -1.6480
quadrupole: -8.6181 7.8786 0.7395 -5.1268 -9.8021 -1.6480
hfenergy: -711.3179944 hartree
pointgroup: C01 [X(C11H21N1O3)]
dipole: -1.1903377 -0.3672739 0.4788415 debye
polarizability: 155.4983628|2.2902953|133.5260417|-5.4718451|-12.2117625|120.0696764 unknown
InChI: InChI=1S/C11H21NO3/c1-4-6-7-9(5-2)11(14)15-8(3)10(12)13/h8-9H,4-7,12H2,1-3H3
charge 0 multiplicity 1
36 atoms
O  0.81746 0.386748 -0.757675
O  0.455459 -0.014904 1.510185
O  4.157064 1.014856 -0.927612
N  3.276537 0.286356 1.10474
C  -0.832395 -1.282163 -0.176547
C  -2.247976 -0.874633 0.326491
C  -2.745343 0.478676 -0.227687
C  -0.433285 -2.698235 0.331671
C  -4.181535 0.82208 0.229921
C  0.189159 -0.261647 0.302027
C  0.915841 -3.199668 -0.225574
C  -4.676181 2.177685 -0.318411
C  1.782987 1.505962 -0.429883
C  1.796494 2.423396 -1.643455
C  3.187384 0.908271 -0.122944
H  -0.820144 -1.273499 -1.282621
H  -2.954116 -1.675724 0.029148
H  -2.237129 -0.846046 1.433984
H  -2.706857 0.462441 -1.336621
H  -2.062089 1.290878 0.0965
H  -0.405144 -2.680167 1.438361
H  -1.240411 -3.398259 0.039893
H  -4.217408 0.833926 1.33825
H  -4.870865 0.016132 -0.095468
H  1.753331 -2.549183 0.088128
H  1.13338 -4.221405 0.134486
H  0.908188 -3.22349 -1.330985
H  -4.672967 2.183013 -1.42475
H  -4.024956 3.00456 0.022398
H  -5.705678 2.398802 0.017742
H  1.394081 2.00575 0.478076
H  0.774675 2.769597 -1.872794
H  2.216263 1.899038 -2.516194
H  2.436768 3.299283 -1.441236
H  4.164958 -0.135237 1.375339
H  2.441654 0.186213 1.694422
