program: Gaussian 09
title: 000217824
version: EM64L-G09RevD.01
frameworkgroup: C1[X(C10H15N5O2)]
method: RPBEPBE
basis: SDD
operation: Freq
keyword: #p
keyword: freq=noraman
keyword: PBEPBE/SDD
title: #p freq=noraman PBEPBE/SDD
converged: YES YES NO NO
title: Mulliken charges:
elementType: O O N N N N N C C C C C C C C C C H H H H H H H H H H H H H H H
charge: -0.317672 -0.300170 -0.163964 -0.072642 -0.141123 -0.369220 -0.565064 -0.420181 -0.436612 -0.479751 0.349507 -0.087364 -0.424193 0.306462 0.195244 -0.246306 -0.664397 0.226839 0.271171 0.240730 0.244894 0.277172 0.238714 0.278481 0.215976 0.236555 0.312290 0.214407 0.252975 0.221007 0.302952 0.303283
chargesum: 0.00000
title: Mulliken charges with hydrogens summed into heavy atoms:
elementType: O O N N N N N C C C C C C C C C C
charge: -0.317672 -0.300170 -0.163964 -0.072642 -0.141123 -0.056930 0.041171 0.077829 0.049012 0.036134 0.349507 -0.087364 -0.145712 0.306462 0.195244 0.206224 0.023993
polarizability: 2.07930035e+02 1.28611188e+01 1.55043849e+02 -1.69199089e+00 9.38302334e+00 9.76468606e+01
1716.lowfreq: -2.8803 -0.0009 -0.0006 -0.0005 5.8686 12.1801 24.7364 40.0911 64.7169
frequency: 24.5784 40.0716 64.6749 80.4791 95.7181 107.6717 138.2376 153.9374 171.6877 184.8129 228.0385 284.3611 296.7701 312.7300 334.3673 353.4396 360.7623 394.5099 425.9049 431.7196 498.9853 508.1712 520.4772 580.5858 597.3677 607.7375 616.3438 659.4686 694.7780 723.4471 740.0901 759.2301 769.6868 809.4476 835.9441 899.2104 931.2919 937.3034 953.7342 981.2542 1015.2962 1044.6489 1072.6055 1095.5869 1108.2512 1117.6604 1152.9014 1169.4600 1181.2082 1205.9069 1216.6433 1221.7621 1231.6148 1235.3541 1267.0379 1282.6123 1310.9906 1323.7705 1348.0752 1358.5123 1367.2359 1387.9397 1400.6573 1423.4642 1453.9780 1456.8100 1462.5541 1469.1016 1477.2843 1484.7159 1489.3829 1529.0855 1591.7272 1644.6751 1671.1196 2937.6848 2975.0930 2990.0895 2994.9693 3028.0851 3066.9851 3067.1536 3084.5119 3090.1662 3099.1179 3115.7994 3154.9166 3450.4341 3466.9710 3580.1978
redmass: 4.0359 4.0726 3.0123 3.7521 4.3919 5.3404 4.1035 4.1728 3.3363 2.1651 1.3596 4.0899 2.5581 3.3938 1.2205 4.4389 2.5547 3.9266 5.2829 4.3059 1.6754 3.3276 2.9231 5.5459 4.9069 1.0880 5.1512 4.0535 10.4791 5.4059 3.9300 3.0740 3.6937 1.3944 3.2367 1.4559 2.6939 3.6530 2.3560 1.7996 2.6372 2.8701 2.6403 2.1398 2.9267 6.0100 1.6695 2.8161 1.6026 1.9422 2.4909 1.4031 2.6142 1.1778 2.3543 1.1107 1.7543 1.5412 1.3485 1.8050 1.7487 1.2386 2.5277 3.1781 1.1170 1.1168 1.0501 1.1309 1.1011 1.0572 2.2618 4.0309 5.3164 9.1059 1.1837 1.0712 1.0700 1.0360 1.0633 1.0591 1.0941 1.0916 1.0981 1.1029 1.0948 1.1058 1.0924 1.0423 1.0739 1.1056
irintensity: 0.5363 2.2424 1.2107 11.3528 0.9916 1.3678 0.7145 2.9162 2.1960 3.7182 3.7777 2.2787 2.8871 13.3003 79.9249 10.2429 10.6190 9.1308 0.7884 0.6659 174.7519 37.1406 27.7349 39.2575 3.1771 71.7136 20.7882 4.1342 16.8751 4.0282 3.0715 9.2598 5.5567 2.4442 5.7147 15.2565 23.2241 19.8839 8.9360 24.6331 57.7400 51.5437 108.0803 37.0084 13.5287 70.4599 39.4461 49.6210 15.0494 80.1515 17.5035 169.6934 19.0248 0.7387 64.5601 3.6221 50.4311 12.1224 15.6235 12.3233 3.9406 33.1620 117.7503 17.0438 25.4780 58.9459 16.6786 12.8342 17.0894 26.0910 132.0503 7.1903 157.9560 437.8796 54.8013 36.2092 43.2970 20.0153 24.9055 39.6961 16.7139 8.2834 38.8020 5.4021 3.1909 31.5341 1.4964 0.8385 34.4701 3.9905
temp: 298.150 k
press: 1.00000 atm
elementType: 8 8 7 7 7 7 7 6 6 6 6 6 6 6 6 6 6 1 1 1 1 1 1 1 1 1 1 1 1 1 1 1
symmnumber: 1
zpe: 672784.8 jmol-1
zpe.correction: 0.256250 hartree
zpe.thermalcorrener: 0.272851 hartree
zpe.thermalcorrenthalpy: 0.273796 hartree
zpe.thermalcorrgfe: 0.210957 hartree
zpe.sumelectzpe: -812.937113 hartree
zpe.sumelectthermal: -812.920512 hartree
zpe.sumelectthermalent: -812.919568 hartree
zpe.sumelectthermalfe: -812.982407 hartree
dipole: -1.9921 -5.7619 -1.6578
dipole: 6.3180
quadrupole: -89.3169 -95.4542 -99.1815
quadrupole: 12.3139 7.2177 -3.7409
quadrupole: 5.3340 -0.8034 -4.5306 12.3139 7.2177 -3.7409
hfenergy: -813.1933637 hartree
pointgroup: C01 [X(C10H15N5O2)]
dipole: -0.6469902 -2.1990904 -0.9612705 debye
polarizability: 206.2153412|16.0595972|153.1584935|-0.0018457|16.9112316|101.2469102 unknown
InChI: InChI=1S/C10H15N5O2/c1-2-17-10(16)15-4-3-8-7(6-15)5-9(12-11)14-13-8/h5,12H,2-4,6,11H2,1H3
charge 0 multiplicity 1
32 atoms
O  3.083882 -1.073872 -0.489719
O  3.730492 1.14812 -0.044103
N  1.492475 0.589355 -0.48954
N  -2.394601 1.37438 0.951462
N  -3.428358 0.497167 0.786435
N  -4.331655 -1.491677 0.002599
N  -4.301855 -2.721204 -0.661455
C  1.028857 1.990728 -0.396743
C  -0.062669 2.106418 0.685569
C  0.493257 -0.43424 -0.841839
C  -0.883723 -0.126699 -0.267798
C  -1.151499 1.077875 0.450225
C  -1.942277 -1.027899 -0.453381
C  2.832183 0.304879 -0.315738
C  -3.204562 -0.683609 0.099828
C  4.492368 -1.494449 -0.239882
C  4.739793 -1.739496 1.25133
H  0.62615 2.308678 -1.380101
H  1.904129 2.614973 -0.159652
H  -0.512896 3.114733 0.687337
H  0.395118 1.952118 1.681822
H  0.85145 -1.410056 -0.475007
H  0.406884 -0.525243 -1.946757
H  -1.832349 -1.972027 -0.994785
H  4.593826 -2.417222 -0.834237
H  5.166057 -0.712655 -0.631974
H  -5.182907 -1.12635 0.444037
H  5.765163 -2.12615 1.402219
H  4.639615 -0.79925 1.818983
H  4.028445 -2.481438 1.65433
H  -4.825593 -2.75632 -1.539908
H  -4.390204 -3.544469 -0.06016
