program: Gaussian 09
title: 000217806
version: EM64L-G09RevD.01
frameworkgroup: C1[X(C17H19F3N2O2)]
method: RPBEPBE
basis: SDD
operation: Freq
keyword: #p
keyword: freq=noraman
keyword: PBEPBE/SDD
title: #p freq=noraman PBEPBE/SDD
converged: NO YES NO NO
title: Mulliken charges:
elementType: F F F O O N N C C C C C C C C C C C C C C C C C H H H H H H H H H H H H H H H H H H H
charge: -0.163312 -0.166999 -0.171264 -0.286845 -0.239564 -0.122397 -0.229924 -0.256254 -0.456333 -0.553165 0.216062 -0.395782 -0.385892 -0.378002 -0.372597 -0.406120 0.157734 0.463203 -0.445271 -0.345498 0.308458 -0.207465 -0.400615 0.242934 0.257337 0.301002 0.236404 0.268664 0.250661 0.210808 0.272514 0.225302 0.215164 0.209187 0.214490 0.206329 0.207348 0.228065 0.194315 0.278973 0.313982 0.236944 0.267417
chargesum: 0.00000
title: Mulliken charges with hydrogens summed into heavy atoms:
elementType: F F F O O N N C C C C C C C C C C C C C C C C C
charge: -0.163312 -0.166999 -0.171264 -0.286845 -0.239564 -0.122397 -0.229924 0.001082 0.081072 -0.033839 0.216062 0.087539 0.054574 0.045676 0.041081 0.016260 0.157734 0.463203 -0.166298 -0.031516 0.308458 0.029479 -0.133197 0.242934
polarizability: 2.89392268e+02 -1.58527822e-01 1.99592196e+02 -6.93483579e-01 5.08775390e+00 1.32509773e+02
1716.lowfreq: -26.4499 -13.3897 -5.2909 -0.0007 0.0001 0.0005 5.6451 12.2646 18.8410
frequency: -13.3644 -7.7985 12.5719 39.6852 51.3601 59.7720 81.3469 104.1930 119.0238 134.1438 160.8545 180.4370 191.9500 231.4151 257.2936 271.6264 290.3785 296.9013 305.7576 341.6079 357.1968 390.1554 393.5757 398.5565 423.1591 432.4103 443.9361 483.3124 498.6758 517.0842 541.4969 559.1143 601.8368 608.7362 626.9918 633.3395 653.9919 693.9799 697.3785 705.3309 757.5819 788.9247 801.2986 812.5370 830.7067 843.6755 874.9846 877.9952 910.5735 932.9548 934.3137 947.8024 948.4828 979.4007 980.6675 982.3379 1004.4067 1009.1432 1017.7296 1041.3136 1052.4754 1070.2406 1089.1209 1090.8494 1101.9185 1119.0571 1121.3446 1136.5264 1153.1791 1156.5694 1192.2379 1203.1332 1212.7834 1223.6550 1234.7373 1255.7796 1259.6553 1267.8921 1273.5755 1289.8213 1310.6865 1323.9465 1327.6556 1335.4559 1337.8234 1343.6570 1347.5729 1356.3971 1362.3092 1396.1976 1422.0540 1445.5666 1450.6504 1455.9455 1461.1808 1465.1086 1472.2009 1481.6440 1489.0079 1500.0326 1574.7889 1593.6440 1619.5951 1632.9310 2955.3103 2961.3734 2970.0571 2985.7172 2990.8299 2996.9303 3007.3715 3024.5180 3041.4868 3049.2869 3058.2190 3066.2884 3089.9452 3093.3492 3094.5398 3149.9449 3174.7865 3179.8538 3192.8017
redmass: 15.6746 4.6011 4.4252 4.4521 6.7326 4.7338 6.9942 3.6260 4.7833 6.1759 4.5819 3.5013 3.2409 4.7190 3.0722 3.9969 3.1871 4.1953 6.3097 8.6749 4.0821 4.5657 2.5704 3.5003 3.3228 5.2709 3.4323 4.1922 3.4134 3.8785 3.9264 3.7324 2.9340 11.8391 5.5904 4.4416 7.0826 2.1862 6.6316 5.6931 6.2543 4.6635 1.5035 1.3781 2.7545 1.5079 2.5003 1.6981 2.3519 2.0302 1.4354 1.4078 3.6731 2.4908 8.9554 5.8774 1.3357 6.2072 2.3849 1.9102 1.9538 3.1468 1.9668 2.3180 3.2916 1.9750 2.2997 2.1513 1.3449 1.2894 1.1111 1.5963 2.0003 1.5609 2.2159 1.2737 1.4021 2.2491 1.2311 1.4675 1.9083 1.3082 1.3449 1.7023 1.4174 1.4787 1.4619 1.4051 2.1123 6.2272 3.0435 1.4083 2.0648 1.0894 1.0870 1.0927 1.0827 1.0995 2.3769 1.1591 7.3461 6.2710 6.0754 10.3828 1.0710 1.0697 1.0647 1.0609 1.0611 1.0584 1.0656 1.0844 1.0959 1.1023 1.1031 1.1057 1.0986 1.0919 1.0923 1.0889 1.0914 1.0946 1.0961
irintensity: 0.0415 0.4107 0.5125 0.2300 3.2882 0.8591 2.4055 1.8849 5.2285 0.2643 2.5434 0.4096 0.6433 3.3178 2.6459 1.6620 4.1539 1.9355 0.5472 9.9523 16.0352 2.8481 5.6678 8.4925 4.1169 0.0847 1.4361 4.5955 0.3284 3.9202 11.0175 1.3018 1.0590 14.1442 5.9472 4.9067 9.2936 23.8495 4.6286 4.0285 16.6492 0.4611 0.2579 72.8770 1.9304 18.3949 16.7715 17.6551 4.8446 13.7302 8.0368 10.3032 33.5619 2.6447 200.9039 34.9305 4.2729 149.4936 33.3191 11.7521 24.0914 87.1389 37.9046 46.7634 9.1949 29.7618 8.5459 10.5172 4.6032 2.8772 7.1860 77.2703 150.1019 98.1154 59.5558 2.9370 35.8352 70.0831 30.5474 32.6560 142.5686 0.5615 52.4587 114.0611 34.5637 7.7604 7.7133 10.2241 77.3865 17.0319 141.5111 68.6230 53.1999 8.5605 15.7659 17.7875 12.5431 7.8757 123.0093 7.5341 279.6067 21.8213 96.7982 248.6753 25.0760 48.0380 44.5668 27.3452 28.9281 17.6940 4.8179 13.4925 56.4959 34.1839 74.3099 16.1471 14.2047 22.3679 14.4334 10.2158 3.1282 2.1019 9.5776
temp: 298.150 k
press: 1.00000 atm
elementType: 9 9 9 8 8 7 7 6 6 6 6 6 6 6 6 6 6 6 6 6 6 6 6 6 1 1 1 1 1 1 1 1 1 1 1 1 1 1 1 1 1 1 1
symmnumber: 1
zpe: 886197.3 jmol-1
zpe.correction: 0.337535 hartree
zpe.thermalcorrener: 0.357416 hartree
zpe.thermalcorrenthalpy: 0.358360 hartree
zpe.thermalcorrgfe: 0.287556 hartree
zpe.sumelectzpe: -1216.949529 hartree
zpe.sumelectthermal: -1216.929648 hartree
zpe.sumelectthermalent: -1216.928704 hartree
zpe.sumelectthermalfe: -1216.999508 hartree
dipole: 6.9983 1.4081 2.9217
dipole: 7.7134
quadrupole: -117.4398 -156.2842 -144.8641
quadrupole: -11.7251 5.0394 -0.7301
quadrupole: 22.0896 -16.7548 -5.3348 -11.7251 5.0394 -0.7301
hfenergy: -1217.2870636 hartree
pointgroup: C01 [X(C17H19F3N2O2)]
dipole: 2.7757871 -0.3867161 -1.1639242 debye
polarizability: 289.3110769|2.087138|198.2305778|2.1324953|10.9359307|133.9525829 unknown
InChI: InChI=1S/C17H19F3N2O2/c18-17(19,20)13-5-4-6-14(10-13)22-11-12(9-15(22)23)16(24)21-7-2-1-3-8-21/h4-6,10,12H,1-3,7-9,11H2
charge 0 multiplicity 1
43 atoms
F  -6.065863 1.686477 -0.205439
F  -4.445845 2.272882 1.270484
F  -4.133637 2.623523 -0.94116
O  2.260907 1.043869 1.79443
O  -0.26189 -3.491448 0.015206
N  4.024204 0.379678 0.430382
N  -0.597475 -1.127882 -0.030772
C  1.693279 -0.400042 -0.095267
C  0.237546 0.097371 0.099602
C  1.625725 -1.900044 0.303307
C  2.679916 0.405229 0.773149
C  4.999408 1.120454 1.271315
C  4.635702 -0.348716 -0.704526
C  5.815514 2.112972 0.41487
C  5.448467 0.613085 -1.605745
C  6.493801 1.392356 -0.773836
C  0.166485 -2.306617 0.071608
C  -2.013385 -1.043074 -0.136486
C  -2.644661 0.222723 -0.020669
C  -2.819103 -2.198988 -0.361835
C  -4.048549 0.325417 -0.140191
C  -4.216386 -2.070642 -0.471996
C  -4.850206 -0.812896 -0.36708
C  -4.668471 1.686709 -0.008935
H  1.951152 -0.32112 -1.165926
H  0.12911 0.557844 1.099098
H  -0.04548 0.836985 -0.669434
H  1.853278 -2.042504 1.377178
H  2.298961 -2.556846 -0.270478
H  5.682612 0.386709 1.749117
H  4.429084 1.630806 2.062997
H  3.862238 -0.868545 -1.289514
H  5.317142 -1.126421 -0.297391
H  6.572827 2.603548 1.055008
H  5.139476 2.905289 0.038724
H  4.754558 1.325371 -2.093949
H  5.941966 0.028466 -2.405492
H  7.028267 2.11863 -1.41375
H  7.255535 0.683516 -0.387197
H  -2.060514 1.125697 0.173828
H  -2.338811 -3.175954 -0.437174
H  -4.819769 -2.967712 -0.644449
H  -5.935318 -0.717357 -0.457506
