program: Gaussian 09
title: 000019028
version: EM64L-G09RevD.01
frameworkgroup: C1[X(C22H26N2)]
method: RPBEPBE
basis: SDD
operation: Freq
keyword: #pfreq=noraman
keyword: PBEPBE/SDD
title: #p freq=noraman PBEPBE/SDD
converged: YES YES NO NO
title: Mulliken charges:
elementType: N N C C C C C C C C C C C C C C C C C C C C C C H H H H H H H H H H H H H H H H H H H H H H H H H H
charge: -0.061607 -0.409627 -0.001356 -0.444651 -0.436582 -0.373290 -0.394017 -0.608155 -0.343500 0.429010 -0.579897 0.102465 -0.454171 0.223748 0.500469 -0.414906 -0.357424 -0.261930 -0.414653 -0.413060 -0.219247 -0.229079 -0.228851 -0.244480 0.213963 0.213268 0.193488 0.203517 0.190257 0.204542 0.173217 0.170409 0.211504 0.206577 0.209174 0.192043 0.218736 0.211818 0.221072 0.268721 0.302251 0.230920 0.225258 0.218642 0.231508 0.232973 0.220044 0.222392 0.222388 0.226108
chargesum: 0.00000
title: Mulliken charges with hydrogens summed into heavy atoms:
elementType: N N C C C C C C C C C C C C C C C C C C C C C C
charge: -0.061607 -0.107377 0.212608 -0.037895 -0.042808 0.004469 -0.012105 -0.192403 0.067279 0.429010 -0.147007 0.102465 -0.185450 0.223748 0.500469 -0.183986 -0.132167 -0.043288 -0.183144 -0.180087 0.000797 -0.006687 -0.006463 -0.018372
polarizability: 3.06583133e+02 -2.79023462e+01 2.23854360e+02 1.38284599e+01 1.11771343e+01 2.06435930e+02
1716.lowfreq: -8.8353 -4.7476 -4.4335 -0.0006 0.0002 0.0009 10.6501 14.9345 20.7171
frequency: 10.1983 14.7483 20.6409 31.5894 41.4073 50.1080 70.2067 98.5872 132.3887 169.5598 197.1169 218.7218 226.1996 242.3296 254.1733 269.7558 319.3372 328.5732 360.3788 377.7141 404.1518 422.3922 425.5217 444.7424 463.4667 469.5490 498.4315 510.6447 534.6595 563.7795 576.0809 580.8876 613.8956 617.8174 637.7324 705.2695 730.6990 745.1371 747.4436 750.1086 762.6774 767.8984 789.8553 793.6044 806.8854 818.2228 833.7865 849.2264 853.8924 865.6335 896.0085 916.6517 929.3139 943.6170 968.5068 970.9422 975.5154 977.9893 989.9520 992.2286 1010.1796 1010.9062 1022.1590 1026.3528 1045.8207 1048.5275 1074.7876 1085.7970 1091.1625 1101.0082 1115.9296 1118.3601 1133.0404 1137.2613 1157.4854 1166.3805 1171.1296 1185.2722 1186.1950 1198.1138 1216.4265 1235.4092 1244.0268 1250.0223 1264.1547 1267.7927 1280.6413 1285.2229 1291.9328 1298.3545 1313.5757 1324.5671 1326.0244 1332.7960 1345.0792 1349.9866 1351.8335 1365.5519 1382.1666 1389.8242 1390.0957 1420.3470 1439.4231 1448.0155 1457.8442 1459.3297 1461.7725 1465.3056 1470.4206 1476.2082 1481.5310 1483.5247 1486.2091 1563.1079 1585.9943 1592.2081 1614.1637 1630.9845 2815.2030 2823.6271 2850.6040 2950.8910 2957.3768 2971.6641 2977.6492 2995.8784 3015.3666 3016.0603 3021.9497 3033.5532 3034.7206 3046.0988 3060.7749 3113.0364 3113.8470 3121.1113 3128.6115 3129.8522 3141.3599 3142.6632 3160.3261 3160.8260 3218.0525 3614.1987
redmass: 4.5114 4.0890 4.3157 3.6360 3.9324 3.8092 4.1416 3.4708 3.8830 4.0438 4.2931 3.9933 2.7738 1.9533 2.5756 2.8268 3.3206 3.1038 2.1379 3.3898 2.8261 2.8346 1.9532 3.6668 3.5654 2.9140 1.2728 3.0018 5.1983 3.7796 3.1123 4.4756 2.8568 6.3397 2.8073 1.7693 4.2757 2.6687 1.3406 4.1697 2.6319 3.3572 1.2936 1.5140 1.5213 2.5552 2.5365 1.5136 1.2462 4.9955 1.8688 1.4863 1.3836 1.6224 1.2979 2.1864 1.3890 1.6334 6.2918 1.3162 2.1632 2.1384 2.3187 2.1906 2.7009 3.2682 2.2161 1.7094 1.7479 1.8326 1.7403 2.4934 1.6557 1.7525 1.4042 1.1241 1.0537 1.4128 1.1306 1.3894 2.3395 2.2335 1.4966 1.4780 1.2805 1.2750 1.2943 1.5075 1.6598 1.4250 1.3514 1.5007 1.2658 1.3202 1.5466 1.6942 1.6023 1.4109 7.5070 1.9339 2.5832 2.3549 2.1802 1.0906 1.1387 3.6931 1.0879 1.0953 1.0861 1.1230 3.0342 2.1960 1.1063 6.2647 6.1901 6.0512 6.1728 6.8938 1.0716 1.0705 1.0699 1.0802 1.0615 1.0593 1.0617 1.0608 1.0999 1.0872 1.0864 1.0903 1.0987 1.1010 1.1026 1.0862 1.0873 1.0846 1.0889 1.0909 1.0959 1.0952 1.1015 1.1001 1.0982 1.0808
irintensity: 0.0630 0.0366 0.2930 0.1091 0.5964 0.4970 0.1733 0.0618 2.5088 0.2629 0.9055 7.9128 1.2942 0.4156 0.9848 1.8701 0.8617 0.1374 4.0447 1.6146 0.0012 12.6408 0.1208 4.7108 0.6949 2.0148 98.6835 13.0263 1.4901 4.1651 10.5614 6.4444 3.5992 0.0907 0.1512 52.4485 0.9942 11.3716 112.7688 3.0403 28.1162 16.8476 6.6393 13.0475 0.5537 2.8087 10.5378 0.1968 0.0140 0.6193 1.1322 2.9695 3.0438 2.3534 0.0770 30.2398 0.0490 5.3779 0.0310 0.0442 1.2429 12.2733 2.3880 6.3408 26.2134 2.9744 6.2769 12.0381 25.9224 34.8867 43.8603 3.4847 8.5940 12.8557 0.8173 2.6374 0.0948 7.9017 0.5817 0.6257 0.2950 13.2035 20.8542 4.2074 2.2268 17.9281 1.0103 1.6091 8.3496 9.4703 1.3418 2.8300 0.2411 25.1260 17.9081 12.2576 4.4989 11.1276 0.6029 14.0603 22.4033 3.4593 6.8696 3.2054 2.0267 22.7589 1.9104 18.1613 1.7591 0.7454 2.0622 26.1620 10.2851 2.9971 0.0958 1.4670 13.1110 2.1297 42.7145 85.0439 133.2795 5.4043 37.0677 43.9784 37.0228 21.0809 14.1315 2.4559 80.0467 13.1381 74.5639 60.0577 30.7343 11.9577 5.4363 2.4951 5.0089 12.4524 47.5494 41.9870 26.9140 29.2247 1.5901 58.4840
temp: 298.150 k
press: 1.00000 atm
elementType: 7 7 6 6 6 6 6 6 6 6 6 6 6 6 6 6 6 6 6 6 6 6 6 6 1 1 1 1 1 1 1 1 1 1 1 1 1 1 1 1 1 1 1 1 1 1 1 1 1 1
symmnumber: 1
zpe: 1120432.0 jmol-1
zpe.correction: 0.426750 hartree
zpe.thermalcorrener: 0.447971 hartree
zpe.thermalcorrenthalpy: 0.448916 hartree
zpe.thermalcorrgfe: 0.372145 hartree
zpe.sumelectzpe: -961.699438 hartree
zpe.sumelectthermal: -961.678217 hartree
zpe.sumelectthermalent: -961.677272 hartree
zpe.sumelectthermalfe: -961.754043 hartree
dipole: -1.0246 0.1189 -1.4694
dipole: 1.7953
quadrupole: -139.2964 -139.4973 -133.8985
quadrupole: -3.2965 16.8629 -1.0333
quadrupole: -1.7323 -1.9332 3.6655 -3.2965 16.8629 -1.0333
hfenergy: -962.1261879 hartree
pointgroup: C01 [X(C22H26N2)]
dipole: -0.3910645 0.2991261 -0.5064548 debye
polarizability: 306.457153|-31.5693916|211.6044762|2.0578595|12.9694191|218.8117936 unknown
InChI: InChI=1S/C22H26N2/c1-2-6-18(7-3-1)10-13-24-14-11-19(12-15-24)16-20-17-23-22-9-5-4-8-21(20)22/h1-9,17,19,23H,10-16H2
charge 0 multiplicity 1
50 atoms
N  1.660205 -0.901752 -0.123164
N  -5.075156 0.860739 -1.932079
C  -1.28938 -1.219666 -0.141878
C  -0.55736 -0.187088 -1.029535
C  -0.32461 -2.387594 0.171135
C  0.772381 0.259423 -0.390831
C  0.996011 -1.876584 0.780579
C  -2.605149 -1.7352 -0.797223
C  2.997568 -0.500775 0.373749
C  -3.665222 -0.67674 -0.980335
C  3.906688 0.082857 -0.743109
C  -4.456888 -0.050389 0.069175
C  -4.075387 -0.095359 -2.179878
C  -5.33099 0.90941 -0.557161
C  5.299366 0.400041 -0.220808
C  -4.52065 -0.214652 1.479381
C  -6.245364 1.69586 0.17823
C  -5.431345 0.564798 2.218869
C  5.589675 1.662123 0.359972
C  6.32907 -0.576108 -0.258873
C  -6.283299 1.511696 1.57548
C  6.870736 1.943266 0.886575
C  7.611959 -0.300943 0.266078
C  7.887502 0.961091 0.842274
H  -1.55178 -0.720607 0.816472
H  -1.202275 0.695499 -1.199896
H  -0.342745 -0.644682 -2.016576
H  -0.097531 -2.935789 -0.765037
H  -0.799061 -3.103299 0.872193
H  1.292649 0.958829 -1.069793
H  0.555682 0.819434 0.558958
H  0.779969 -1.419255 1.78392
H  1.689218 -2.722371 0.947711
H  -3.005754 -2.557194 -0.167771
H  -2.352111 -2.187463 -1.777286
H  2.928546 0.238723 1.21333
H  3.493528 -1.401093 0.784477
H  3.444353 0.99877 -1.156685
H  3.949094 -0.660377 -1.56028
H  -3.729866 -0.294753 -3.193073
H  -5.545959 1.418318 -2.64057
H  -3.87458 -0.941087 1.985517
H  -6.904375 2.422285 -0.310951
H  -5.491519 0.446509 3.306608
H  4.807176 2.431111 0.391207
H  6.12322 -1.555142 -0.71014
H  -6.980488 2.104432 2.178358
H  7.077367 2.925663 1.326855
H  8.395996 -1.065807 0.22217
H  8.882586 1.177792 1.247055
