program: Gaussian 09
title: 000223922
version: EM64L-G09RevD.01
frameworkgroup: C1[X(C18H19NO2)]
method: RPBEPBE
basis: SDD
operation: Freq
keyword: #p
keyword: freq=noraman
keyword: PBEPBE/SDD
title: #p freq=noraman PBEPBE/SDD
converged: YES YES NO NO
title: Mulliken charges:
elementType: O O N C C C C C C C C C C C C C C C C C C H H H H H H H H H H H H H H H H H H H
charge: -0.307212 -0.256704 -0.076033 0.002592 -0.482142 -0.484564 -0.426766 -0.487007 0.449160 0.192045 -0.439652 -0.370094 0.214572 -0.221032 -0.229729 -0.245918 -0.342464 -0.339784 -0.221405 -0.219874 -0.224408 0.256143 0.263293 0.221007 0.246751 0.241896 0.226716 0.216804 0.217877 0.225580 0.222415 0.265792 0.223193 0.224292 0.226575 0.270214 0.270144 0.233782 0.231228 0.232718
chargesum: 0.00000
title: Mulliken charges with hydrogens summed into heavy atoms:
elementType: O O N C C C C C C C C C C C C C C C C C C
charge: -0.307212 -0.256704 -0.076033 0.258735 0.002158 0.004082 0.016754 -0.043549 0.449160 0.192045 -0.217236 -0.104301 0.214572 0.002161 -0.005437 -0.019343 -0.072250 -0.069641 0.012377 0.011354 0.008309
polarizability: 2.38142813e+02 7.80556383e+00 2.40245747e+02 -2.09867661e+01 -3.37415602e+00 1.19211994e+02
1716.lowfreq: -4.0535 -1.1469 -0.0007 -0.0005 -0.0003 9.2497 16.2146 23.0802 25.8085
frequency: 16.0243 23.0618 25.3092 41.2422 56.4326 72.0854 90.6853 116.3368 142.6454 173.6041 214.1797 243.5701 265.8357 315.3548 337.2598 353.7716 404.2161 404.5835 405.7587 414.2895 448.3306 473.0240 486.1940 579.2177 613.7006 616.3816 638.8750 658.8380 679.8584 702.8279 703.7245 711.8831 744.6834 786.4043 795.3889 803.7729 807.8892 823.8696 843.6955 859.8411 866.2135 904.0807 915.4913 940.7684 947.6251 955.7217 981.7577 988.6156 990.0855 991.3993 996.8567 1001.1214 1009.0365 1019.2039 1023.0441 1028.4794 1044.5879 1053.9107 1077.2483 1086.4405 1092.4517 1112.4079 1169.5842 1173.8914 1177.7666 1182.0422 1183.0799 1185.8236 1210.9335 1211.7001 1241.6871 1251.1406 1277.9263 1295.4735 1305.8030 1314.8370 1316.3469 1325.5036 1338.5900 1358.6340 1388.7530 1389.1542 1437.3936 1439.5632 1448.0951 1457.7974 1467.3078 1473.6880 1477.4879 1483.1935 1583.1576 1593.3707 1610.6033 1614.1154 1617.2130 2905.0764 2988.4374 2991.9852 2995.7232 3028.7160 3059.0962 3073.9334 3096.6945 3101.1329 3108.3989 3122.4287 3129.6773 3135.1792 3141.7432 3148.4381 3154.4608 3161.2682 3166.0975 3175.5616
redmass: 5.3946 4.7769 3.9163 3.9072 5.0322 5.5796 3.3296 4.3245 3.2523 4.5165 4.4031 5.5918 3.3503 3.1510 2.3479 4.9292 2.5738 2.6816 2.8219 3.7447 3.9462 2.9487 4.1025 4.5241 6.4354 6.2576 3.4906 4.4082 5.1118 1.6476 2.6962 2.5232 1.7597 4.1484 2.1686 3.8971 4.0325 2.3551 3.1006 1.2477 1.2437 2.8272 1.3831 2.4708 2.2667 1.4196 1.4371 2.3512 5.4910 3.1625 1.3979 1.4938 1.3277 2.9600 2.3673 2.1517 2.2550 2.9434 1.6394 1.7299 1.8084 2.8506 1.0596 1.0577 1.1804 1.1475 1.2758 1.1524 1.7630 1.8280 3.0097 1.3066 1.4111 1.2509 1.5259 1.3303 1.3947 1.2420 1.3740 1.6774 3.9704 9.7126 2.2369 2.0718 1.0845 1.0865 1.1837 1.1014 2.2446 2.0233 6.9659 6.1285 6.2769 6.1453 9.6281 1.0671 1.0657 1.0708 1.0885 1.0617 1.0889 1.0983 1.1037 1.0978 1.0871 1.0861 1.0854 1.0917 1.0890 1.0950 1.0937 1.1011 1.0972 1.0987
irintensity: 0.1045 0.7071 0.0351 0.2714 0.6923 2.2412 0.6846 1.5239 2.0368 0.2263 1.7569 9.7819 8.0011 0.0314 1.0118 1.3665 2.9403 2.3913 0.8196 4.3855 0.8817 18.0144 0.6008 2.2305 0.2081 0.2068 3.7559 8.8047 13.6717 71.5533 39.4485 22.4855 57.1755 11.4814 22.3373 22.8870 9.4654 2.2553 4.1931 0.1813 0.5628 2.6149 4.3164 27.5738 14.5963 2.9158 1.1388 4.1588 1.7411 2.1435 0.5692 5.8254 0.3364 90.1166 39.5173 5.2909 25.5831 217.2928 4.9739 20.9208 16.6254 7.8598 0.5791 0.5307 25.2438 26.7172 9.3056 3.0738 1.4389 0.9447 301.8838 25.7927 5.2215 0.8600 19.3821 4.9748 5.0927 4.5438 3.3270 3.9497 3.7373 1.9393 17.7399 9.0057 15.2338 8.1988 7.9915 8.9091 7.7613 11.8220 48.0348 0.5194 15.6673 11.7323 151.9425 51.7889 51.4981 44.4626 28.5717 18.7142 24.3474 13.3021 32.7221 15.3978 16.9662 0.6922 0.3171 28.3131 10.9769 26.4915 14.2728 25.1931 21.3149 9.8435
temp: 298.150 k
press: 1.00000 atm
elementType: 8 8 7 6 6 6 6 6 6 6 6 6 6 6 6 6 6 6 6 6 6 1 1 1 1 1 1 1 1 1 1 1 1 1 1 1 1 1 1 1
symmnumber: 1
zpe: 858960.0 jmol-1
zpe.correction: 0.327161 hartree
zpe.thermalcorrener: 0.345420 hartree
zpe.thermalcorrenthalpy: 0.346364 hartree
zpe.thermalcorrgfe: 0.277100 hartree
zpe.sumelectzpe: -900.991841 hartree
zpe.sumelectthermal: -900.973582 hartree
zpe.sumelectthermalent: -900.972638 hartree
zpe.sumelectthermalfe: -901.041902 hartree
dipole: 0.0312 -1.2397 0.7310
dipole: 1.4395
quadrupole: -121.1327 -112.2207 -124.4999
quadrupole: 10.8453 -6.0528 0.8803
quadrupole: -1.8483 7.0637 -5.2154 10.8453 -6.0528 0.8803
hfenergy: -901.3190021 hartree
pointgroup: C01 [X(C18H19N1O2)]
dipole: -0.0222584 -0.3141081 0.4707296 debye
polarizability: 241.1284356|2.4224347|214.7016264|-13.4796656|-49.7659906|141.7704916 unknown
InChI: InChI=1S/C18H19NO2/c20-18(16-9-5-2-6-10-16)21-17-11-12-19(14-17)13-15-7-3-1-4-8-15/h1-10,17H,11-14H2
charge 0 multiplicity 1
40 atoms
O  -0.853911 0.830311 -0.839517
O  -2.790046 1.749834 -1.764191
N  2.084034 1.956387 -0.36172
C  -0.031665 1.848762 -1.576094
C  1.432887 1.337694 -1.5507
C  0.007902 3.200266 -0.805498
C  1.499165 3.329513 -0.330521
C  1.889807 1.192869 0.906492
C  2.662751 -0.122563 0.920665
C  -2.238169 0.886848 -1.035086
C  2.116838 -1.265219 1.556557
C  3.952263 -0.215627 0.337747
C  -2.952438 -0.186903 -0.283105
C  2.846818 -2.474551 1.622285
C  4.682113 -1.423166 0.397504
C  4.133443 -2.557559 1.042195
C  -4.370807 -0.20116 -0.329566
C  -2.258109 -1.178028 0.459097
C  -5.089718 -1.195402 0.364823
C  -2.982132 -2.17255 1.14998
C  -4.396883 -2.18253 1.106212
H  -0.461535 1.943821 -2.587495
H  1.499521 0.239065 -1.52653
H  1.945548 1.699771 -2.463289
H  -0.693126 3.162287 0.045438
H  -0.300289 4.0394 -1.451193
H  2.06068 3.967772 -1.039584
H  1.594848 3.7724 0.675062
H  0.818181 0.984033 1.132102
H  2.271729 1.841721 1.719896
H  1.116759 -1.206002 2.00626
H  4.358383 0.666935 -0.168473
H  2.41173 -3.349722 2.118635
H  5.677856 -1.48139 -0.057332
H  4.699689 -3.494806 1.087983
H  -4.883377 0.571191 -0.912612
H  -1.16451 -1.163702 0.477774
H  -6.18441 -1.203851 0.329235
H  -2.447028 -2.940553 1.719084
H  -4.95599 -2.956189 1.644478
