program: Gaussian 09
title: 000223920
version: EM64L-G09RevD.01
frameworkgroup: C1[X(C17H22N2O2)]
method: RPBEPBE
basis: SDD
operation: Freq
keyword: #p
keyword: freq=noraman
keyword: PBEPBE/SDD
title: #p freq=noraman PBEPBE/SDD
converged: YES YES NO NO
title: Mulliken charges:
elementType: O O N N C C C C C C C C C C C C C C C C C H H H H H H H H H H H H H H H H H H H H H H
charge: -0.268555 -0.220702 -0.191725 -0.438971 -0.415931 -0.422050 -0.526775 0.323847 0.238098 -0.181975 0.190352 -0.389600 -0.379802 -0.327096 -0.478618 0.161051 -0.256249 -0.250095 -0.682461 -0.023322 -0.596900 0.275202 0.201077 0.268805 0.229185 0.218652 0.232365 0.244080 0.185469 0.212903 0.229034 0.307801 0.199534 0.215276 0.324979 0.226473 0.227018 0.218228 0.238217 0.218924 0.226584 0.219715 0.217959
chargesum: 0.00000
title: Mulliken charges with hydrogens summed into heavy atoms:
elementType: O O N N C C C C C C C C C C C C C C C C C
charge: -0.268555 -0.220702 -0.191725 -0.113992 0.060348 0.075939 -0.075758 0.323847 0.238098 0.062105 0.190352 0.008772 -0.150768 -0.019294 -0.063808 0.161051 -0.029776 -0.023076 -0.007092 0.203262 -0.159227
polarizability: 2.60702893e+02 2.48076879e+00 2.02854533e+02 2.40692284e+00 1.52389367e+01 1.45481543e+02
1716.lowfreq: -8.3110 -2.5792 -0.0006 -0.0005 0.0005 6.5562 20.8888 26.9053 40.7662
frequency: 20.0193 26.7988 40.7470 63.1008 69.2223 86.2039 92.5106 108.2208 123.8851 148.8545 152.6129 171.6704 184.3721 199.4582 229.7696 238.6599 304.8979 334.4620 350.2578 358.7939 366.2686 388.2388 422.2822 439.3424 449.1568 464.4118 492.1908 523.3151 538.9566 561.2490 592.2870 625.6460 629.2868 663.4261 676.3988 702.0887 721.0057 744.4972 767.8645 781.2275 797.0778 856.2623 870.1674 886.4631 888.6416 900.9981 916.0680 922.3359 949.2551 960.6063 961.8281 983.4289 995.2570 1006.5764 1026.0862 1038.8984 1046.0557 1047.2866 1071.4783 1083.2940 1089.7611 1114.5686 1122.2813 1135.4539 1171.1643 1178.5014 1189.7776 1195.6236 1214.7117 1224.5083 1229.4991 1252.6056 1256.4377 1259.1241 1287.9008 1293.1982 1312.5579 1324.1523 1333.2697 1336.0115 1343.3916 1353.9646 1367.7378 1379.3477 1399.9282 1427.1473 1435.0200 1441.4162 1451.4396 1455.0331 1474.1106 1474.8761 1478.2104 1482.4330 1488.6012 1493.8088 1585.8289 1605.1002 1618.0335 1631.4365 1658.2012 2957.6898 2961.5839 2961.9997 2971.0323 2983.5649 3007.8804 3016.1687 3016.9793 3029.3041 3035.1791 3079.9783 3081.1829 3082.7496 3091.2669 3093.6420 3113.7850 3134.8065 3151.2026 3158.5422 3195.0798 3203.5376 3498.5070
redmass: 4.3677 4.6674 5.7956 3.2070 3.6690 2.9092 2.9920 6.6303 3.4535 2.3355 2.6675 1.8751 2.8541 5.2121 1.9249 2.6443 3.3528 3.2346 3.1015 3.7134 3.2088 3.0720 4.9733 2.5102 2.9744 3.4176 3.4718 3.6593 4.3251 3.6425 3.0450 2.2899 1.8139 2.4796 2.8069 3.5771 2.9603 3.8768 1.4772 2.1755 1.7453 1.4662 2.4912 1.9605 1.7059 2.0515 1.7948 2.6474 1.3538 1.5032 2.0329 2.3192 1.3047 1.1812 3.2028 1.7468 2.1858 2.1338 1.7400 1.9421 2.4450 2.1663 2.6574 2.2145 1.2482 1.3709 1.7048 1.5814 1.9263 1.7340 2.0999 1.3861 1.4561 1.2248 1.5112 1.2280 1.2845 1.3601 1.6406 1.6247 1.5805 1.5911 1.6519 6.5328 1.2051 1.1843 1.9072 2.2141 1.1207 1.1615 1.0909 1.0468 1.0548 1.6444 1.1133 1.2895 6.6105 5.4728 7.5075 5.5279 4.7136 1.0623 1.0622 1.0653 1.0726 1.0362 1.0893 1.0665 1.0973 1.0924 1.0941 1.0994 1.0673 1.0997 1.1006 1.0875 1.0877 1.0895 1.0902 1.0988 1.1143 1.0937 1.0753
irintensity: 0.6930 0.4818 2.3387 0.1376 0.1116 0.5932 1.8193 9.0959 0.9994 0.1161 0.3304 1.1558 2.4699 5.0699 1.5993 3.6100 2.8315 0.4097 0.8654 1.6263 2.2304 3.6447 5.5842 1.2494 8.5990 2.3595 0.7811 3.7464 3.5892 3.7070 1.2980 34.9731 33.5401 9.0385 22.7676 4.7947 7.4017 36.7662 93.5577 4.9014 9.3688 11.5561 11.3456 1.8343 6.1582 5.4040 0.3825 7.3862 101.6664 7.6029 0.5104 31.0060 1.9076 17.3774 0.1912 4.3797 5.3087 11.4960 12.9946 7.6405 0.4418 4.3058 44.1866 47.4412 23.4752 86.6532 65.4189 5.0082 51.4134 34.5943 23.0073 90.0343 23.7388 0.7845 13.4170 0.9431 0.7206 4.4203 49.1579 29.5985 176.1493 116.6114 114.5186 16.5676 12.3079 11.5479 130.4601 9.4980 9.7280 14.4214 15.1960 6.9496 10.8491 54.5686 18.8410 33.5837 5.9934 210.4010 192.1714 55.4579 14.4214 10.0742 57.9806 21.5538 37.2134 22.1447 15.7289 29.6073 3.7034 28.1021 50.9910 38.6433 28.9036 42.2275 16.7073 6.3375 10.5546 16.8151 3.5067 33.6970 23.0874 13.2345 20.7489
temp: 298.150 k
press: 1.00000 atm
elementType: 8 8 7 7 6 6 6 6 6 6 6 6 6 6 6 6 6 6 6 6 6 1 1 1 1 1 1 1 1 1 1 1 1 1 1 1 1 1 1 1 1 1 1
symmnumber: 1
zpe: 941781.4 jmol-1
zpe.correction: 0.358706 hartree
zpe.thermalcorrener: 0.379340 hartree
zpe.thermalcorrenthalpy: 0.380284 hartree
zpe.thermalcorrgfe: 0.307859 hartree
zpe.sumelectzpe: -919.402485 hartree
zpe.sumelectthermal: -919.381851 hartree
zpe.sumelectthermalent: -919.380907 hartree
zpe.sumelectthermalfe: -919.453332 hartree
dipole: -2.6229 2.2148 -0.8865
dipole: 3.5455
quadrupole: -107.1957 -123.4778 -129.9444
quadrupole: 7.7189 3.5524 -0.5564
quadrupole: 13.0103 -3.2718 -9.7384 7.7189 3.5524 -0.5564
hfenergy: -919.7611908 hartree
pointgroup: C01 [X(C17H22N2O2)]
dipole: -0.9821841 -0.9702428 0.1992852 debye
polarizability: 259.7374232|2.6982961|192.6309669|-10.9732555|26.4377551|156.6705792 unknown
InChI: InChI=1S/C17H22N2O2/c1-3-8-13(4-2)16(20)18-17(21)19-12-7-10-14-9-5-6-11-15(14)19/h3,5-6,9,11,13,18H,1,4,7-8,10,12H2,2H3
charge 0 multiplicity 1
43 atoms
O  0.427573 1.748576 1.973947
O  -1.484636 -0.051771 -1.127482
N  1.054731 -0.14898 0.698525
N  -1.261295 0.387631 1.169334
C  1.108334 -1.844889 -1.121774
C  0.673445 -1.543086 0.318244
C  2.643017 -1.777056 -1.200724
C  3.219265 -0.597522 -0.421046
C  2.450636 0.189299 0.496159
C  -3.536804 0.210291 0.205704
C  0.146409 0.715181 1.292937
C  -4.038882 1.569076 0.770712
C  4.582711 -0.270061 -0.615274
C  3.073412 1.271704 1.180441
C  -4.016265 -0.985393 1.090732
C  -2.01105 0.172261 -0.002886
C  5.200288 0.800706 0.059991
C  4.431734 1.572021 0.959294
C  -3.623969 2.786149 -0.082643
C  -3.639435 -2.338862 0.52512
C  -2.962956 -3.304864 1.195752
H  0.627894 -1.107783 -1.78608
H  0.747876 -2.848002 -1.415244
H  -0.406473 -1.674871 0.44629
H  1.189377 -2.229478 1.021959
H  3.075462 -2.714949 -0.793994
H  2.975857 -1.716574 -2.253967
H  -3.95281 0.081274 -0.811858
H  -3.686094 1.70606 1.815318
H  -5.144059 1.516575 0.834493
H  5.163711 -0.874159 -1.323919
H  2.484279 1.86893 1.875848
H  -3.621962 -0.883121 2.120824
H  -5.121642 -0.90989 1.163876
H  -1.783352 0.769935 1.964972
H  6.257173 1.029998 -0.113425
H  4.885876 2.410415 1.498979
H  -3.97907 2.678274 -1.123899
H  -2.525764 2.904296 -0.114552
H  -4.049618 3.718657 0.329187
H  -3.950156 -2.524671 -0.514829
H  -2.729851 -4.269847 0.731986
H  -2.629219 -3.159976 2.231267
