program: Gaussian 09
title: 000223899
version: EM64L-G09RevD.01
frameworkgroup: C1[X(C14H14N2O)]
method: RPBEPBE
basis: SDD
operation: Freq
keyword: #p
keyword: freq=noraman
keyword: PBEPBE/SDD
title: #p freq=noraman PBEPBE/SDD
converged: YES YES NO NO
title: Mulliken charges:
elementType: O N N C C C C C C C C C C C C C C H H H H H H H H H H H H H H
charge: -0.164081 -0.116426 -0.037606 -0.487905 0.194781 0.139197 -0.110501 -0.015038 0.379166 0.182757 -0.711901 -0.738267 -0.700365 -0.385417 -0.377618 -0.209077 -0.217398 0.306092 0.227386 0.217287 0.254908 0.239714 0.215085 0.223072 0.216527 0.242679 0.200483 0.274156 0.277615 0.239559 0.241134
chargesum: 0.00000
title: Mulliken charges with hydrogens summed into heavy atoms:
elementType: O N N C C C C C C C C C C C C C C
charge: -0.164081 -0.116426 -0.037606 -0.181813 0.194781 0.139197 -0.110501 -0.015038 0.379166 0.182757 -0.012320 -0.060395 -0.040676 -0.111261 -0.100003 0.030482 0.023735
polarizability: 2.51234071e+02 1.82942270e-01 1.65674508e+02 -1.16006651e+00 -6.73763753e-01 9.41613730e+01
1716.lowfreq: -8.6863 -2.7335 -0.0005 0.0000 0.0002 3.1841 35.4246 53.7723 106.5101
frequency: 35.3823 53.7490 106.5075 116.0928 141.0329 171.8110 202.8792 223.8712 240.7118 267.2021 277.2250 289.5100 308.8553 333.3010 346.3547 401.2397 413.7482 435.8191 475.2685 507.9703 529.5086 542.8274 555.8993 608.3933 650.5627 677.4513 697.6950 761.7461 772.8065 787.5373 823.7006 826.4079 875.7883 892.2521 901.7733 924.4346 936.5773 956.5834 975.6756 1005.8579 1008.1057 1017.7073 1020.7933 1024.8627 1043.4373 1085.9566 1109.6333 1140.7534 1169.4106 1178.6621 1187.5611 1197.2634 1223.8453 1251.5953 1300.3209 1307.5904 1373.0813 1378.6945 1394.2121 1399.3415 1435.8565 1439.6850 1455.8887 1456.9553 1466.8618 1469.0968 1480.2657 1483.9949 1503.3236 1523.4960 1583.7260 1607.0493 1650.0434 2967.6163 2972.0140 2978.9781 2987.5748 3070.8072 3075.3999 3077.9874 3083.8698 3090.1612 3100.8361 3138.7801 3152.0679 3165.4646 3175.1824
redmass: 3.1359 5.0943 4.3547 4.9823 7.4048 3.3015 1.0340 4.1309 3.5983 1.1293 1.7537 1.6509 3.6626 2.8913 2.8078 3.5776 3.6865 3.9287 4.8282 6.1840 8.0945 3.5819 3.2372 3.8730 7.9826 6.7288 7.0396 4.4063 1.3802 4.9293 4.7552 4.1428 5.3909 2.9911 1.7710 1.7955 1.5850 1.2284 1.4132 1.3993 2.4368 2.0014 1.6707 1.4734 2.4571 2.1783 2.4260 1.5823 1.3226 2.1785 1.7825 2.7149 3.0964 2.8948 4.8161 2.1319 1.1843 1.2002 4.6208 1.4340 2.7915 3.4367 1.0923 2.5612 1.0565 1.0523 1.0528 1.0573 1.1214 10.3431 6.7410 7.4180 11.8381 1.0798 1.0347 1.0344 1.0359 1.1007 1.1000 1.0999 1.0994 1.1013 1.0993 1.0864 1.0906 1.0959 1.0999
irintensity: 0.0362 3.6352 3.1025 0.8334 2.5523 2.6042 0.0054 0.2512 3.2936 0.2635 0.6241 0.3085 3.3559 1.7157 1.9476 0.4289 0.1067 3.4755 8.7306 3.0454 0.7644 15.4590 0.4984 14.0260 3.1240 3.4463 1.4994 4.6415 72.9348 6.1985 4.4278 8.6978 44.5019 2.2873 1.4648 2.9661 2.3183 0.5948 3.9149 0.2721 1.8326 6.2901 0.3808 3.1155 19.2167 13.4524 22.6724 14.0123 11.2653 87.4533 4.1129 8.7386 8.7949 73.0563 15.2468 1.1843 21.4481 23.9374 6.2065 2.0574 25.3217 29.3526 1.7628 20.3896 3.1107 2.9575 8.8433 18.0913 37.8507 11.3100 1.6986 101.7781 175.4432 3.0272 25.6345 23.9172 40.1540 17.4452 8.5052 21.0620 70.1394 13.7348 26.7756 2.1111 5.4049 9.4482 18.0483
temp: 298.150 k
press: 1.00000 atm
elementType: 8 7 7 6 6 6 6 6 6 6 6 6 6 6 6 6 6 1 1 1 1 1 1 1 1 1 1 1 1 1 1
symmnumber: 1
zpe: 642740.5 jmol-1
zpe.correction: 0.244807 hartree
zpe.thermalcorrener: 0.259801 hartree
zpe.thermalcorrenthalpy: 0.260745 hartree
zpe.thermalcorrgfe: 0.203118 hartree
zpe.sumelectzpe: -725.353573 hartree
zpe.sumelectthermal: -725.338579 hartree
zpe.sumelectthermalent: -725.337635 hartree
zpe.sumelectthermalfe: -725.395262 hartree
dipole: 3.0644 2.0043 1.8280
dipole: 4.0926
quadrupole: -77.2070 -113.8046 -100.1072
quadrupole: -4.7382 -1.9886 -2.4350
quadrupole: 19.8326 -16.7650 -3.0676 -4.7382 -1.9886 -2.4350
hfenergy: -725.5983799 hartree
pointgroup: C01 [X(C14H14N2O1)]
dipole: 1.1804734 -0.6318991 -0.8943084 debye
polarizability: 251.0934766|1.0174048|163.5677936|-4.7340007|12.0985277|96.4086816 unknown
InChI: InChI=1S/C14H14N2O/c1-14(2,3)13-10-11(15-16-13)8-6-4-5-7-9(8)12(10)17/h4-7,10H,1-3H3
charge 0 multiplicity 1
31 atoms
O  -0.031644 -2.420118 -0.244172
N  -1.673579 1.68995 0.750254
N  -0.233114 2.085751 0.699139
C  -0.528177 0.045229 -0.486208
C  -3.153209 -0.243482 0.132002
C  -1.824666 0.492048 0.175611
C  0.385658 1.149779 -0.009434
C  0.356253 -1.229014 -0.27787
C  1.782603 0.707266 -0.065129
C  1.764246 -0.721884 -0.198839
C  -3.093668 -1.378078 1.205736
C  -3.350737 -0.885988 -1.270977
C  -4.325363 0.717907 0.450615
C  3.004831 1.395759 0.065132
C  2.959756 -1.468658 -0.215116
C  4.202647 0.642035 0.041928
C  4.184491 -0.772361 -0.096867
H  -0.683314 0.099416 -1.586504
H  -2.957488 -0.951894 2.215513
H  -4.044722 -1.942069 1.192209
H  -2.270466 -2.085074 1.000758
H  -2.558116 -1.624611 -1.491248
H  -3.361332 -0.119208 -2.068432
H  -4.320028 -1.415776 -1.299678
H  -4.400674 1.519992 -0.30517
H  -4.184947 1.201272 1.43159
H  -5.275898 0.153248 0.46134
H  3.023018 2.483357 0.179738
H  2.926996 -2.558851 -0.309135
H  5.164555 1.157444 0.13828
H  5.129893 -1.324887 -0.103768
