program: Gaussian 09
title: 000223925
version: EM64L-G09RevD.01
frameworkgroup: C1[X(C20H20N2O8)]
method: RPBEPBE
basis: SDD
operation: Freq
keyword: #p
keyword: freq=noraman
keyword: PBEPBE/SDD
title: #p freq=noraman PBEPBE/SDD
converged: YES YES NO NO
title: Mulliken charges:
elementType: O O O O O O O O N N C C C C C C C C C C C C C C C C C C C C H H H H H H H H H H H H H H H H H H H H
charge: -0.246508 -0.245946 -0.246597 -0.247864 -0.203449 -0.203515 -0.205234 -0.205212 0.027725 0.027704 -0.406169 -0.406738 0.569251 0.566373 0.221989 0.225899 -0.375563 -0.374416 -0.421120 -0.421508 -0.374276 -0.374646 -0.361156 -0.360814 0.378213 0.378075 -0.263189 -0.262982 -0.655903 -0.656652 0.295887 0.295927 0.274151 0.274813 0.249245 0.249180 0.287898 0.287892 0.289005 0.288930 0.235402 0.230090 0.229718 0.234847 0.235305 0.245067 0.219761 0.235722 0.245858 0.219531
chargesum: 0.00000
title: Mulliken charges with hydrogens summed into heavy atoms:
elementType: O O O O O O O O N N C C C C C C C C C C C C C C C C C C C C
charge: -0.246508 -0.245946 -0.246597 -0.247864 -0.203449 -0.203515 -0.205234 -0.205212 0.027725 0.027704 -0.110282 -0.110812 0.569251 0.566373 0.221989 0.225899 -0.101412 -0.099603 -0.171875 -0.172329 -0.086379 -0.086754 -0.072151 -0.071884 0.378213 0.378075 0.202302 0.201583 0.044230 0.044459
polarizability: 3.34720124e+02 -3.61394725e-01 2.47916059e+02 -4.69053540e-01 -2.50938026e+01 2.27213296e+02
1716.lowfreq: -1.3874 -0.0005 0.0002 0.0003 5.3303 8.3445 11.8005 19.2323 20.8827
frequency: 11.5964 18.9112 20.8274 26.0716 33.2438 35.3104 40.3880 46.3366 47.7912 71.6188 72.3001 83.1684 86.7923 94.8103 108.7010 132.8865 133.7818 135.6224 166.6621 185.5971 188.8181 206.5368 220.7748 250.0510 283.7296 297.3004 297.7830 301.3019 331.8338 338.9642 387.9559 390.5378 409.4149 409.5229 413.6970 443.6848 482.9953 503.6774 504.7203 506.7813 566.8334 579.7393 620.2405 622.6667 628.9454 662.0330 669.2475 672.9178 685.0619 703.4762 714.6155 748.3325 748.6621 769.5338 781.9058 795.8802 798.5574 812.1730 816.6951 850.4751 852.1621 857.2201 859.7920 869.8556 874.2232 916.4496 958.4855 989.8294 991.4112 1000.2165 1001.7294 1002.2332 1007.2052 1008.2894 1012.5423 1062.9113 1092.4930 1092.5585 1094.9452 1097.0310 1107.8740 1113.5791 1127.7760 1149.9293 1156.3963 1158.4282 1184.4141 1184.9717 1194.6490 1197.1608 1220.1759 1223.3901 1229.3947 1255.1637 1275.3627 1276.8232 1288.9490 1308.3053 1310.3461 1331.1058 1354.2373 1356.1902 1368.8161 1369.0583 1392.3882 1394.8329 1401.4080 1401.7649 1422.9130 1422.9768 1456.4403 1457.8620 1460.4263 1461.7687 1479.6169 1480.0360 1480.5041 1482.6613 1597.1968 1597.4120 1605.8511 1606.3885 1621.4032 1625.5400 2996.2999 2996.5132 3032.8226 3034.1188 3057.9902 3071.6071 3092.2317 3092.5536 3097.9494 3098.2233 3124.3121 3124.3933 3139.3158 3140.4643 3147.1031 3147.5572 3181.7134 3181.7722 3184.6793 3184.7995
redmass: 6.3727 3.8244 6.9817 4.6095 6.7035 6.0885 3.3973 4.2639 4.8679 5.4742 5.4095 5.1974 4.9999 4.7535 6.4112 6.5845 6.0074 5.8351 6.0407 2.0138 1.5132 7.1355 2.2692 2.7676 4.6697 4.2202 4.3005 3.7749 5.9414 5.7171 7.3202 6.7448 2.9114 2.9230 4.0186 3.9627 3.6766 4.4443 7.3710 5.3900 4.7524 5.2760 7.2193 7.0374 6.6565 5.7026 4.9795 4.6949 5.2936 5.7100 5.6257 4.6899 3.6867 4.0602 6.7263 5.1492 2.5971 1.4098 1.6382 2.9939 1.5566 1.3412 2.6085 1.5677 1.9229 4.3890 3.0905 1.3748 1.4052 1.8257 1.5653 1.5820 3.1269 3.0070 2.7511 5.8178 3.2120 3.2099 2.2009 2.1596 1.3614 1.3406 2.8262 2.4067 1.6878 1.8254 1.3628 1.4136 1.6498 2.3655 5.5582 5.4999 2.1408 1.7239 1.1253 1.1265 1.5660 1.3510 1.4007 1.3296 1.3286 1.3458 7.2596 7.0634 1.2298 1.2308 8.1098 7.9369 3.1320 3.1899 1.0963 1.0948 1.0438 1.0450 1.0665 2.3455 2.4085 1.0529 7.8500 7.8360 6.2136 6.3163 8.4005 8.4428 1.0361 1.0361 1.0600 1.0599 1.0841 1.0845 1.0982 1.0980 1.1020 1.1022 1.1066 1.1064 1.0909 1.0908 1.0908 1.0908 1.0943 1.0943 1.0954 1.0954
irintensity: 0.6207 0.4973 0.1054 0.9121 0.1983 0.1280 0.0825 1.8485 3.7079 0.2136 0.0369 0.8160 1.6134 0.7773 0.9853 2.5750 0.0332 1.5021 4.8149 9.2270 0.2432 0.2907 1.9502 0.8183 2.1485 4.4544 4.3351 10.6324 11.0229 10.2041 5.2842 6.7786 0.0969 0.0969 8.5708 5.4382 12.2314 1.4241 1.2343 2.2321 20.7162 2.2808 0.2867 0.4127 0.3005 0.0384 34.2948 7.2003 27.5270 1.2518 37.2373 5.1121 4.8049 1.4131 26.7896 29.7468 10.5177 7.8409 6.3598 32.2982 0.4885 0.4205 1.1169 22.0883 45.7795 1.7145 5.3168 1.9099 0.6041 30.5044 15.8197 18.4139 1.9697 0.1099 37.0742 112.1961 13.6508 15.2702 73.3213 15.6738 52.0685 12.5012 226.9998 240.8505 28.3200 82.6533 48.8312 82.7051 2.3569 4.1935 251.5548 341.2073 28.3320 93.3224 6.2353 6.2661 59.0692 28.9976 12.0626 51.9311 3.8953 11.7005 154.9149 47.8611 19.2084 25.3882 0.6565 0.1164 3.3806 80.8386 13.3558 14.2726 23.5924 2.0036 18.0667 6.9628 7.9794 17.6579 16.8013 2.7502 61.5816 93.2341 7.8783 216.5545 15.8844 18.1545 29.7343 24.8092 0.1062 2.8319 29.4576 35.2287 3.5657 3.4508 23.3274 31.9942 1.3145 1.3387 2.1404 9.7882 0.4667 0.7111 3.7233 3.5875
temp: 298.150 k
press: 1.00000 atm
elementType: 8 8 8 8 8 8 8 8 7 7 6 6 6 6 6 6 6 6 6 6 6 6 6 6 6 6 6 6 6 6 1 1 1 1 1 1 1 1 1 1 1 1 1 1 1 1 1 1 1 1
symmnumber: 1
zpe: 982914.0 jmol-1
zpe.correction: 0.374372 hartree
zpe.thermalcorrener: 0.403712 hartree
zpe.thermalcorrenthalpy: 0.404656 hartree
zpe.thermalcorrgfe: 0.307703 hartree
zpe.sumelectzpe: -1483.086556 hartree
zpe.sumelectthermal: -1483.057216 hartree
zpe.sumelectthermalent: -1483.056272 hartree
zpe.sumelectthermalfe: -1483.153226 hartree
dipole: 9.2595 -0.0211 -0.0049
dipole: 9.2595
quadrupole: -196.7641 -200.0136 -168.9189
quadrupole: 0.1319 0.1531 13.7959
quadrupole: -8.1986 -11.4481 19.6467 0.1319 0.1531 13.7959
hfenergy: -1483.4609283 hartree
pointgroup: C01 [X(C20H20N2O8)]
dipole: -0.2093023 3.636758 0.0369317 debye
polarizability: 240.9727512|-5.8655307|334.3400567|26.8493353|2.8932509|234.5366711 unknown
InChI: InChI=1S/C20H20N2O8/c1-3-29-19(23)17(13-5-9-15(10-6-13)21(25)26)18(20(24)30-4-2)14-7-11-16(12-8-14)22(27)28/h5-12,17-18H,3-4H2,1-2H3
charge 0 multiplicity 1
50 atoms
O  2.051238 2.824763 -1.149859
O  -2.386942 2.521705 1.212477
O  1.197523 3.032652 1.013276
O  -1.622042 2.844822 -0.969539
O  4.326208 -4.267899 0.14925
O  -3.78619 -4.774593 -0.234319
O  4.573171 -3.398796 2.244019
O  -4.108943 -3.921152 -2.32523
N  4.090056 -3.370353 1.04665
N  -3.647523 -3.846814 -1.121287
C  0.605648 1.073383 -0.382787
C  -0.748524 0.972161 0.396166
C  1.538981 -0.082977 -0.013407
C  -1.521982 -0.288235 0.000194
C  1.289078 2.411799 -0.073579
C  -1.605873 2.213796 0.115384
C  2.107444 -0.160273 1.286507
C  -2.064247 -0.418579 -1.306574
C  1.82592 -1.10031 -0.957029
C  -1.692997 -1.343733 0.930081
C  2.945274 -1.233541 1.641021
C  -2.761935 -1.581264 -1.681646
C  2.659969 -2.184049 -0.619652
C  -2.387481 -2.515904 0.572645
C  3.207749 -2.234007 0.679659
C  -2.911969 -2.616846 -0.733298
C  2.779231 4.130667 -1.00357
C  -3.280152 3.72387 1.091549
C  1.866224 5.292124 -1.401702
C  -2.505845 4.997966 1.436142
H  0.40381 1.052869 -1.466393
H  -0.543486 0.954047 1.47898
H  1.905241 0.632261 2.016191
H  -1.954856 0.402335 -2.024441
H  1.39341 -1.043443 -1.96158
H  -1.281471 -1.246262 1.940344
H  3.397862 -1.310427 2.633058
H  -3.192131 -1.70076 -2.679417
H  2.891269 -2.979731 -1.332466
H  -2.529113 -3.341259 1.275083
H  3.124317 4.221707 0.041133
H  3.63836 4.020524 -1.683467
H  -4.085431 3.514744 1.812754
H  -3.682656 3.755656 0.06393
H  1.480303 5.157131 -2.426226
H  1.0117 5.376134 -0.709439
H  2.435822 6.239102 -1.365904
H  -2.054647 4.925838 2.440135
H  -1.705746 5.182568 0.700138
H  -3.194421 5.862984 1.424643
