program: Gaussian 09
title: 000217805
version: EM64L-G09RevD.01
frameworkgroup: C1[X(C17H22N2O3)]
method: RPBEPBE
basis: SDD
operation: Freq
keyword: #p
keyword: freq=noraman
keyword: PBEPBE/SDD
title: #p freq=noraman PBEPBE/SDD
converged: YES YES NO NO
title: Mulliken charges:
elementType: O O O N N C C C C C C C C C C C C C C C C C H H H H H H H H H H H H H H H H H H H H H H
charge: -0.289438 -0.253344 -0.267288 -0.123331 -0.216566 -0.256281 -0.454027 -0.548672 -0.395791 -0.383775 0.215120 -0.377395 -0.373330 -0.406199 0.144081 0.429657 -0.349988 -0.332060 -0.356208 -0.382290 0.329591 -0.537552 0.253429 0.293868 0.229441 0.262422 0.244570 0.209322 0.271599 0.227236 0.213169 0.207044 0.213340 0.205577 0.205817 0.226119 0.193785 0.303780 0.251200 0.240078 0.248690 0.221641 0.220030 0.242931
chargesum: 0.00000
title: Mulliken charges with hydrogens summed into heavy atoms:
elementType: O O O N N C C C C C C C C C C C C C C C C C
charge: -0.289438 -0.253344 -0.267288 -0.123331 -0.216566 -0.002852 0.069282 -0.041679 0.085129 0.056630 0.215120 0.042989 0.038064 0.013705 0.144081 0.429657 -0.046208 -0.080860 -0.116130 -0.133600 0.329591 0.147050
polarizability: 3.21711027e+02 1.40518504e+01 1.91127650e+02 -3.62763380e+00 -1.59881364e-01 1.32019040e+02
1716.lowfreq: -5.3884 -0.0003 0.0006 0.0008 3.6947 12.5127 23.2740 33.0782 50.0167
frequency: 22.9790 32.7429 49.8235 60.8792 69.5062 72.6699 102.4588 111.4959 132.6347 161.6007 179.2819 188.6966 215.9577 255.0567 257.2955 272.2628 284.8372 317.1040 359.1435 384.0838 389.4480 397.8781 416.7531 421.1005 446.8234 458.8419 504.4340 520.5693 535.3131 562.7643 591.9427 608.0574 633.6160 636.1343 698.7560 707.1176 722.9638 767.1578 789.3400 802.4936 812.5882 831.3363 833.1418 847.6007 876.8633 912.1597 922.8351 933.4097 944.7857 947.4382 969.8165 979.4726 988.1702 1003.4725 1017.5882 1043.5388 1053.2619 1088.2393 1097.7449 1103.2393 1113.2405 1122.6059 1126.8704 1137.0693 1150.9156 1155.9528 1159.1238 1185.6167 1203.8578 1218.5500 1223.3237 1231.2498 1236.1387 1254.3847 1257.7275 1273.7841 1282.2325 1296.8134 1315.9250 1327.4168 1334.0998 1340.1617 1345.7469 1347.6664 1357.5465 1364.8895 1385.5286 1422.7425 1431.4183 1437.7318 1448.4081 1456.0120 1462.9302 1465.9604 1466.7203 1472.5146 1473.3421 1481.4501 1498.9528 1507.7497 1573.0535 1579.1973 1622.6515 1629.0281 2953.9278 2956.3759 2960.6815 2971.6871 2985.8181 2989.9046 2997.0136 3005.8221 3020.6731 3040.5700 3042.8347 3048.5009 3057.5859 3063.1066 3086.6327 3091.9655 3096.3773 3122.4200 3152.6587 3155.2271 3173.4187 3189.0382
redmass: 4.4870 4.3292 3.5082 4.6604 4.3108 4.3823 4.9683 3.2713 4.5584 3.2291 3.8419 2.9505 1.7227 1.9377 2.7010 3.5285 2.5367 4.3014 4.0396 4.6296 5.6943 1.8480 3.0840 3.4332 3.1611 4.3394 2.4630 2.4467 3.2836 3.2583 4.3028 3.2327 6.7681 4.2703 6.0178 5.2984 3.8201 5.2752 4.5993 1.5341 1.2896 2.2080 1.9018 1.4948 2.6599 2.3254 3.5722 1.8292 1.5403 1.3370 1.3201 2.4402 8.0691 2.7273 2.3950 1.8562 1.9216 1.4576 3.1654 3.4912 1.2598 2.3896 1.5315 2.0921 1.3522 1.2928 1.3378 1.3275 1.2586 3.4104 1.5844 2.5037 2.3288 1.3883 1.2812 1.2170 1.4810 1.5717 1.3151 1.3047 1.6144 1.3745 1.4060 1.5364 1.3966 3.3593 3.7240 3.0149 3.2401 1.2092 1.0969 1.0907 1.0867 1.0499 1.0953 1.0823 1.0775 1.0975 1.2120 2.0354 7.3914 7.3451 10.5051 6.3335 1.0713 1.0331 1.0697 1.0637 1.0609 1.0611 1.0580 1.0655 1.0840 1.0964 1.1038 1.1025 1.1032 1.1057 1.0989 1.0933 1.0907 1.0992 1.0873 1.0894 1.0964 1.0948
irintensity: 1.3921 0.8364 0.1297 4.8500 0.6390 0.0961 7.3924 0.6001 4.6050 2.5825 3.4779 3.5430 0.7159 1.3639 0.2520 2.9337 3.9474 1.0482 14.1820 15.7556 6.5158 2.8771 0.2956 4.9776 0.9772 1.0930 1.3568 21.4734 17.0027 1.7008 5.4043 1.6073 0.1294 19.8837 3.2562 7.6787 0.2235 7.8262 8.0541 0.5048 5.6966 30.4507 58.3164 20.0020 3.3988 4.4167 2.3242 0.5115 0.6119 6.7539 3.5422 3.3274 42.6242 27.5289 36.3500 9.6821 12.6139 3.4012 64.0745 8.3749 0.1916 2.4154 40.4752 8.2019 10.7234 0.2671 0.9838 111.7415 10.0661 54.8919 160.2604 210.2210 73.6720 15.4634 6.6546 12.1771 56.0975 26.6664 4.2458 7.7921 32.7585 4.8480 1.9275 8.2278 7.4295 53.7620 38.2194 143.0004 1.5802 18.1210 9.1700 8.9765 12.2289 12.9419 21.8117 11.5036 76.4389 7.3184 129.2820 225.9846 265.4951 3.9344 300.1363 8.4528 25.6109 79.1823 53.4701 41.8391 28.2622 30.7320 21.4605 7.4120 13.9057 58.7777 50.9500 32.8441 78.8430 18.5578 17.8197 9.2688 27.3140 28.7846 14.5354 10.6488 7.1479 8.4002
temp: 298.150 k
press: 1.00000 atm
elementType: 8 8 8 7 7 6 6 6 6 6 6 6 6 6 6 6 6 6 6 6 6 6 1 1 1 1 1 1 1 1 1 1 1 1 1 1 1 1 1 1 1 1 1 1
symmnumber: 1
zpe: 961135.2 jmol-1
zpe.correction: 0.366077 hartree
zpe.thermalcorrener: 0.386390 hartree
zpe.thermalcorrenthalpy: 0.387335 hartree
zpe.thermalcorrgfe: 0.315793 hartree
zpe.sumelectzpe: -994.552917 hartree
zpe.sumelectthermal: -994.532603 hartree
zpe.sumelectthermalent: -994.531659 hartree
zpe.sumelectthermalfe: -994.603201 hartree
dipole: 3.8956 0.2364 3.0293
dipole: 4.9405
quadrupole: -89.4566 -141.1350 -135.1466
quadrupole: 1.1836 3.9915 -0.9151
quadrupole: 32.4562 -19.2223 -13.2339 1.1836 3.9915 -0.9151
hfenergy: -994.9189936 hartree
pointgroup: C01 [X(C17H22N2O3)]
dipole: 1.5468912 -0.1429893 -1.1682366 debye
polarizability: 322.3145365|-9.801998|190.0295211|6.3960623|-4.8136817|132.5136586 unknown
InChI: InChI=1S/C17H22N2O3/c1-22-15-7-5-14(6-8-15)19-12-13(11-16(19)20)17(21)18-9-3-2-4-10-18/h5-8,13H,2-4,9-12H2,1H3
charge 0 multiplicity 1
44 atoms
O  2.317206 1.607589 1.471099
O  -1.02309 -2.722457 0.859439
O  -6.385858 1.014368 -0.445864
N  3.893746 0.280332 0.395062
N  -0.931564 -0.428311 0.207513
C  1.448499 -0.156268 0.012995
C  0.107285 0.621442 0.041176
C  1.125506 -1.472762 0.773566
C  5.003856 1.007012 1.060555
C  4.336881 -0.820024 -0.489559
C  2.583559 0.651584 0.669951
C  5.992185 1.571575 0.017273
C  5.317012 -0.29846 -1.569571
C  6.504377 0.452125 -0.920363
C  -0.391005 -1.653956 0.619528
C  -2.317975 -0.114204 0.054661
C  -3.32377 -1.115717 0.11274
C  -2.713837 1.23712 -0.162966
C  -4.683824 -0.776852 -0.047123
C  -4.068002 1.573004 -0.325439
C  -5.063997 0.568939 -0.270738
C  -7.446167 0.007238 -0.37882
H  1.692646 -0.398001 -1.036524
H  0.103497 1.334849 0.88581
H  -0.059039 1.179069 -0.897144
H  1.352024 -1.382767 1.853332
H  1.655751 -2.361061 0.393773
H  5.533559 0.301933 1.735765
H  4.553437 1.803083 1.673771
H  3.469495 -1.310165 -0.956235
H  4.85323 -1.585221 0.129266
H  6.837433 2.054868 0.542946
H  5.4817 2.354693 -0.57617
H  4.77285 0.384769 -2.250931
H  5.677877 -1.153188 -2.173275
H  7.165658 0.870944 -1.701497
H  7.114187 -0.26622 -0.333706
H  -3.033136 -2.15178 0.295356
H  -1.97151 2.039493 -0.19168
H  -5.431295 -1.574209 0.00673
H  -4.374353 2.610422 -0.489958
H  -7.467548 -0.490617 0.610555
H  -7.329706 -0.756048 -1.173306
H  -8.382482 0.56334 -0.534096
