program: Gaussian 09
title: 000217802
version: EM64L-G09RevD.01
frameworkgroup: C1[X(C16H19ClN2O2)]
method: RPBEPBE
basis: SDD
operation: Freq
keyword: #p
keyword: freq=noraman
keyword: PBEPBE/SDD
title: #p freq=noraman PBEPBE/SDD
converged: YES YES NO NO
title: Mulliken charges:
elementType: Cl O O N N C C C C C C C C C C C C C C C C H H H H H H H H H H H H H H H H H H H
charge: -0.066401 -0.288968 -0.242949 -0.123203 -0.222100 -0.256137 -0.455986 -0.549735 -0.396272 -0.385550 0.215863 -0.377520 -0.372900 -0.406185 0.150473 0.445848 -0.331075 -0.338910 -0.217371 -0.226049 -0.110067 0.256200 0.296346 0.232616 0.265962 0.248199 0.210956 0.271756 0.226611 0.215042 0.208451 0.213550 0.205694 0.207268 0.227446 0.194413 0.310445 0.256341 0.254374 0.253520
chargesum: 0.00000
title: Mulliken charges with hydrogens summed into heavy atoms:
elementType: Cl O O N N C C C C C C C C C C C C C C C C
charge: -0.066401 -0.288968 -0.242949 -0.123203 -0.222100 0.000063 0.072976 -0.035573 0.086440 0.056103 0.215863 0.044482 0.040062 0.015674 0.150473 0.445848 -0.020631 -0.082569 0.037003 0.027472 -0.110067
polarizability: 3.10296935e+02 1.72671235e+01 1.85261604e+02 -4.02364870e+00 1.84097144e+00 1.23366380e+02
1716.lowfreq: -6.0478 -0.0018 0.0005 0.0008 4.1493 12.5024 24.7227 35.9651 50.1570
frequency: 24.4193 34.7930 49.6562 65.2540 71.0530 74.7922 102.9685 128.4679 149.9277 187.0608 191.9664 219.3208 262.3116 268.4261 286.0067 332.4594 353.0830 358.9674 380.5052 400.4933 413.6486 417.8157 445.8681 470.1837 505.2252 512.2672 548.4297 562.6562 605.1167 626.3426 635.6591 678.1246 701.9631 704.4060 729.9030 784.5927 803.5507 811.9318 833.2845 842.2980 851.0706 877.7625 912.7970 922.0304 932.4155 943.1814 947.6554 979.3301 980.4978 993.3429 1017.9260 1043.1389 1053.5197 1077.2150 1088.4457 1096.7643 1102.2389 1122.8354 1126.6244 1137.4714 1152.2394 1155.9068 1195.8577 1201.7225 1214.0673 1223.4510 1235.3898 1254.7549 1257.6544 1273.6075 1283.0920 1297.0628 1308.3113 1327.6401 1334.9113 1340.5658 1346.5447 1347.5796 1356.9659 1358.7539 1381.5755 1411.8072 1423.5046 1446.9576 1456.5334 1464.4170 1469.4022 1473.5767 1483.0154 1485.0881 1499.3428 1574.4337 1578.2259 1604.8611 1628.9626 2956.3056 2964.1542 2972.2738 2986.4594 2990.2767 2998.2681 3006.5880 3021.7796 3041.5422 3049.0517 3058.0186 3065.6277 3089.3085 3093.1277 3094.9386 3157.4455 3164.2123 3176.9858 3192.4427
redmass: 5.8043 4.7745 3.7387 4.8546 4.7802 5.9320 4.8444 4.4146 3.7751 3.5205 5.6523 4.5096 9.2744 2.1813 2.5809 4.7997 4.7825 4.4365 5.8099 1.9096 3.0358 3.2746 3.1098 4.9997 2.9165 2.2896 4.2395 3.1956 2.9184 7.0822 3.9961 7.1173 5.7680 3.6055 5.4426 4.3291 1.5337 1.3809 2.7508 1.4276 1.4768 2.6318 2.2797 3.5251 1.7597 1.6053 1.3365 1.3198 2.4366 4.3450 2.3762 1.8626 1.9445 2.7118 1.4422 3.0361 3.4505 2.4398 1.5529 2.0951 1.3407 1.2819 1.1467 1.3456 3.0630 1.5942 2.2673 1.3661 1.2990 1.2131 1.5495 1.4333 1.3283 1.3136 1.6048 1.3653 1.4411 1.5297 1.5880 2.4480 3.7811 3.2684 3.0565 1.0927 1.0912 1.0870 1.0950 1.0828 1.0979 2.4391 1.1124 7.4031 7.6919 6.0299 10.9407 1.0711 1.0694 1.0641 1.0608 1.0612 1.0581 1.0659 1.0838 1.0963 1.1024 1.1032 1.1057 1.0987 1.0930 1.0915 1.0880 1.0909 1.0967 1.0954
irintensity: 0.4397 1.1418 0.7995 1.5596 0.7050 0.3695 5.1052 2.6998 0.3479 0.7978 3.3497 0.8195 1.9330 1.2990 2.7222 9.2820 10.8755 9.6238 20.0422 3.1023 0.3342 4.2311 0.9364 9.3373 19.9596 10.3416 0.2442 1.3881 1.0877 0.0321 17.9984 6.8093 5.0310 1.2781 21.5289 7.1781 0.7163 25.6122 2.3669 58.5052 19.1815 3.8017 3.9869 2.7229 0.8806 0.8344 6.7327 2.4903 4.0479 33.3665 37.9530 10.3906 14.7661 50.2903 1.4494 26.7763 2.2874 2.5036 45.4055 8.5259 9.6442 0.0040 3.9794 16.1576 97.0857 114.4311 64.2348 16.8553 12.4110 11.2843 103.5453 25.2026 24.7901 16.2259 58.8568 5.7931 3.5327 8.6536 18.3630 68.4851 33.8050 17.8439 127.9274 12.7050 8.9541 13.1561 23.5418 9.8584 7.1987 310.6326 3.4097 265.2573 10.0346 26.1810 280.7731 26.7369 51.1554 40.7532 27.7769 30.0107 19.0198 5.2246 13.9862 57.2144 32.3230 77.9461 17.5565 15.8575 14.0486 22.6902 7.0888 3.1567 5.0378 8.9899
temp: 298.150 k
press: 1.00000 atm
elementType: 17 8 8 7 7 6 6 6 6 6 6 6 6 6 6 6 6 6 6 6 6 1 1 1 1 1 1 1 1 1 1 1 1 1 1 1 1 1 1 1
symmnumber: 1
zpe: 853583.7 jmol-1
zpe.correction: 0.325113 hartree
zpe.thermalcorrener: 0.344010 hartree
zpe.thermalcorrenthalpy: 0.344954 hartree
zpe.thermalcorrgfe: 0.276152 hartree
zpe.sumelectzpe: -1339.592263 hartree
zpe.sumelectthermal: -1339.573366 hartree
zpe.sumelectthermalent: -1339.572422 hartree
zpe.sumelectthermalfe: -1339.641224 hartree
dipole: 7.4343 -0.6589 2.8132
dipole: 7.9761
quadrupole: -124.9434 -137.6154 -135.3738
quadrupole: 5.6195 5.8718 -1.3117
quadrupole: 7.7008 -4.9712 -2.7296 5.6195 5.8718 -1.3117
hfenergy: -1339.9173761 hartree
pointgroup: C01 [X(C16H19Cl1N2O2)]
dipole: 2.9884501 0.2197691 -0.9316957 debye
polarizability: 309.3484202|-14.4316848|184.5935483|17.5968238|-4.0604245|124.9829511 unknown
InChI: InChI=1S/C16H19ClN2O2/c17-13-4-6-14(7-5-13)19-11-12(10-15(19)20)16(21)18-8-2-1-3-9-18/h4-7,12H,1-3,8-11H2
charge 0 multiplicity 1
40 atoms
Cl -7.126133 0.861574 -1.032067
O  1.859816 1.532314 1.485674
O  -1.390244 -2.82096 0.546965
N  3.504844 0.262058 0.441326
N  -1.295475 -0.501798 -0.011077
C  1.086897 -0.198737 -0.06104
C  -0.261599 0.565515 -0.073897
C  0.739562 -1.540351 0.641607
C  4.57681 1.000214 1.157022
C  4.002124 -0.806852 -0.454466
C  2.179222 0.603855 0.671634
C  5.583978 1.607994 0.156362
C  5.000237 -0.237758 -1.492034
C  6.149797 0.522074 -0.7890
C  -0.760325 -1.738855 0.388399
C  -2.670461 -0.203437 -0.239271
C  -3.657261 -1.229666 -0.297532
C  -3.07239 1.150163 -0.417637
C  -5.007361 -0.903211 -0.536632
C  -4.423236 1.475558 -0.658853
C  -5.376201 0.44332 -0.71867
H  1.382972 -0.405761 -1.104548
H  -0.319144 1.240844 0.7996
H  -0.382519 1.161427 -0.995274
H  0.896932 -1.476039 1.735418
H  1.30599 -2.410582 0.273043
H  5.10073 0.293469 1.83461
H  4.088969 1.772986 1.771355
H  3.161878 -1.308114 -0.957791
H  4.518535 -1.572435 0.163474
H  6.401322 2.097069 0.719401
H  5.075412 2.393954 -0.434914
H  4.461316 0.449419 -2.173568
H  5.398083 -1.069562 -2.104301
H  6.825937 0.973254 -1.538562
H  6.756235 -0.196823 -0.199691
H  -3.360873 -2.268646 -0.144496
H  -2.345528 1.964224 -0.354738
H  -5.760849 -1.695098 -0.580291
H  -4.723903 2.5186 -0.792341
