program: Gaussian 09
title: 000223852
version: EM64L-G09RevD.01
frameworkgroup: C1[X(C17H14O2)]
method: RPBEPBE
basis: SDD
operation: Freq
keyword: #pfreq=noraman
keyword: PBEPBE/SDD
title: #p freq=noraman PBEPBE/SDD
converged: YES YES NO NO
title: Mulliken charges:
elementType: O O C C C C C C C C C C C C C C C C C H H H H H H H H H H H H H H
charge: -0.426833 -0.242432 -0.387716 -0.540421 0.281565 0.506572 -0.078239 0.040885 0.290840 -0.452795 -0.378388 -0.371886 -0.368769 -0.225051 -0.222599 -0.247545 -0.237262 -0.250358 -0.238193 0.245002 0.256238 0.269420 0.234173 0.246299 0.294393 0.247997 0.227010 0.227220 0.384531 0.230084 0.228659 0.226817 0.230782
chargesum: 0.00000
title: Mulliken charges with hydrogens summed into heavy atoms:
elementType: O O C C C C C C C C C C C C C C C C C
charge: -0.042302 -0.242432 -0.142715 -0.014763 0.281565 0.506572 -0.078239 0.040885 0.290840 -0.218622 -0.132089 -0.077493 -0.120773 0.001960 0.004621 -0.017461 -0.008603 -0.023541 -0.007411
polarizability: 2.06163248e+02 4.73372923e+00 2.50094322e+02 -1.84966187e+01 8.76072261e+00 1.34069445e+02
1716.lowfreq: 0.0004 0.0006 0.0006 1.1159 5.4179 8.9350 31.1186 38.3681 46.8761
frequency: 31.0555 38.3473 46.8443 64.4486 87.2331 138.3544 156.0537 183.8111 247.9966 266.8913 275.7201 318.6411 334.9525 365.1583 403.1503 403.5231 429.4434 492.8391 549.5412 571.6388 594.5544 606.1544 612.9913 613.7462 620.6297 652.0692 670.1600 695.0556 706.0626 740.9615 774.2625 792.1301 794.8798 851.1710 855.5411 883.0835 921.5833 932.2159 942.9998 978.9126 984.3573 987.4690 989.6483 994.9372 999.0039 1004.3867 1027.7504 1029.0462 1058.5065 1081.7280 1083.6510 1107.9947 1135.6491 1172.7334 1175.5329 1188.3330 1199.4044 1204.7732 1225.6478 1228.8791 1262.1375 1280.8103 1320.8645 1325.8837 1335.7479 1363.0453 1382.2996 1384.4159 1429.9817 1440.4863 1443.4128 1481.8811 1488.6543 1574.1466 1583.4231 1593.0475 1611.0976 1611.6450 1663.1562 2983.2453 3015.2972 3073.0232 3109.9318 3122.3421 3126.9112 3134.2130 3138.3807 3145.3152 3153.9944 3163.6279 3166.4965 3177.6242 3376.9068
redmass: 4.0382 4.5949 4.0395 4.8683 7.4060 5.4279 3.7054 3.8132 4.3537 4.7518 5.9733 5.6307 5.1239 6.4561 2.8156 2.8288 3.9998 4.1554 4.0517 3.1454 3.5467 1.2980 5.3416 5.6806 5.0469 4.6296 5.9851 1.7188 1.6958 3.1546 1.9282 2.5207 4.1430 1.2563 1.2494 5.9687 1.4447 1.4696 2.2652 1.3967 1.8592 2.7417 5.7121 2.0603 1.8517 1.3264 2.1751 2.4688 2.5088 1.9311 2.1643 2.8460 1.2558 1.0555 1.0614 1.1110 2.0311 1.1645 1.3586 1.7295 1.4864 1.8151 2.0982 1.8930 1.3148 2.4722 7.2217 7.5940 1.1476 2.3872 1.9934 2.2773 2.2564 5.6796 10.4622 6.0793 5.8514 6.0889 7.5279 1.0831 1.0616 1.1010 1.0880 1.0861 1.0851 1.0906 1.0894 1.0957 1.0940 1.1014 1.0971 1.0969 1.0636
irintensity: 0.2563 0.8014 0.1172 0.3830 0.1465 0.3515 4.1346 0.3525 0.1019 2.0204 22.9406 0.4778 2.3462 4.4170 0.1142 0.0471 4.2145 3.9287 2.8671 5.9352 42.5420 91.9277 1.8673 1.6782 0.7146 8.3634 0.5852 67.5408 47.0824 33.9738 35.2546 34.7249 12.9652 0.6226 0.1223 10.8890 3.0253 3.3480 14.2418 0.0717 0.6212 2.5627 5.1773 6.0097 5.3954 0.9559 11.3981 4.7487 4.9128 9.1088 42.9851 56.8233 16.1084 0.1890 1.9833 0.1703 15.1320 4.0223 8.7702 88.0437 8.9027 33.9276 66.9633 87.2850 1.6365 173.4748 1.2304 57.9951 19.9404 15.6255 6.6771 18.4005 7.5863 69.4375 410.8743 2.5473 12.7998 7.8457 45.2683 15.2675 10.8083 5.9078 9.5268 2.1279 0.4093 8.1025 12.9767 34.5703 30.7691 25.7406 15.4420 12.6079 87.6711
temp: 298.150 k
press: 1.00000 atm
elementType: 8 8 6 6 6 6 6 6 6 6 6 6 6 6 6 6 6 6 6 1 1 1 1 1 1 1 1 1 1 1 1 1 1
symmnumber: 1
zpe: 681797.8 jmol-1
zpe.correction: 0.259683 hartree
zpe.thermalcorrener: 0.275193 hartree
zpe.thermalcorrenthalpy: 0.276137 hartree
zpe.thermalcorrgfe: 0.215363 hartree
zpe.sumelectzpe: -805.338450 hartree
zpe.sumelectthermal: -805.322941 hartree
zpe.sumelectthermalent: -805.321996 hartree
zpe.sumelectthermalfe: -805.382770 hartree
dipole: 1.1219 -3.0309 -0.8702
dipole: 3.3470
quadrupole: -102.1660 -118.5166 -104.2308
quadrupole: -0.8453 -3.7541 0.2513
quadrupole: 6.1385 -10.2121 4.0737 -0.8453 -3.7541 0.2513
hfenergy: -805.5981331 hartree
pointgroup: C01 [X(C17H14O2)]
dipole: -0.2265848 -1.2215703 0.4363607 debye
polarizability: 207.9172917|-13.3255747|245.154827|-17.9977623|-19.1736892|137.2548956 unknown
InChI: InChI=1S/C17H14O2/c18-15-11-14(12-7-3-1-4-8-12)16(17(15)19)13-9-5-2-6-10-13/h1-10,14,19H,11H2
charge 0 multiplicity 1
33 atoms
O  1.907154 2.621425 -1.033706
O  -0.316712 4.210183 -0.388973
C  -0.717565 0.756342 0.887223
C  -1.317776 2.203491 0.772178
C  0.654677 0.828178 0.18379
C  -1.679167 -0.296879 0.320975
C  0.834649 2.099978 -0.328673
C  -0.293555 2.992848 -0.025063
C  1.598542 -0.292425 0.141623
C  -2.519788 -1.029347 1.196486
C  -1.795675 -0.513447 -1.075325
C  2.850848 -0.174955 -0.539599
C  1.302101 -1.525185 0.79808
C  -3.460774 -1.95513 0.69156
C  -2.733364 -1.439479 -1.5832
C  -3.571102 -2.163116 -0.702504
C  3.762117 -1.248686 -0.556618
C  2.219093 -2.594027 0.779842
C  3.454364 -2.463155 0.102172
H  -0.555349 0.52068 1.958064
H  -1.470616 2.670176 1.762414
H  -2.295233 2.2079 0.25897
H  -2.43987 -0.871303 2.27999
H  -1.142895 0.035563 -1.764371
H  3.097332 0.761934 -1.045942
H  0.346243 -1.651623 1.315139
H  -4.103321 -2.512663 1.382443
H  -2.808607 -1.59972 -2.664752
H  1.689486 3.583329 -1.213583
H  -4.297204 -2.882229 -1.097606
H  4.716432 -1.139407 -1.083883
H  1.970972 -3.531477 1.289756
H  4.166064 -3.296172 0.086389
