program: Gaussian 09
title: 000223865
version: EM64L-G09RevD.01
frameworkgroup: C1[X(C20H28N2O)]
method: RPBEPBE
basis: SDD
operation: Freq
keyword: #p
keyword: freq=noraman
keyword: PBEPBE/SDD
title: #p freq=noraman PBEPBE/SDD
converged: YES YES NO NO
title: Mulliken charges:
elementType: O N N C C C C C C C C C C C C C C C C C C C C H H H H H H H H H H H H H H H H H H H H H H H H H H H H
charge: -0.453663 -0.347124 -0.102652 -0.232120 -0.321024 -0.373837 -0.389003 0.468213 0.489090 -0.325954 -0.322834 -0.346345 -0.462230 -0.420168 -0.375533 -0.673984 -0.671369 -0.239194 -0.226922 -0.243896 -0.232466 -0.234465 -0.243939 0.197826 0.229101 0.181925 0.240258 0.267662 0.225861 0.175965 0.203828 0.187089 0.202369 0.186447 0.281454 0.229952 0.344391 0.245913 0.254588 0.208109 0.227962 0.203962 0.212404 0.227609 0.203813 0.224555 0.222579 0.226236 0.224608 0.220343 0.224610
chargesum: 0.00000
title: Mulliken charges with hydrogens summed into heavy atoms:
elementType: O N N C C C C C C C C C C C C C C C C C C C C
charge: -0.109272 -0.079463 -0.102652 -0.034295 -0.091923 0.048345 0.012823 0.468213 0.489090 0.064963 0.065982 -0.064891 -0.232278 -0.174255 -0.120945 -0.033951 -0.027542 -0.014639 -0.004342 -0.017660 -0.007857 -0.014122 -0.019329
polarizability: 2.21020162e+02 2.00175695e+01 2.37985515e+02 2.33427566e+01 -7.46544831e+00 2.20127061e+02
1716.lowfreq: -14.1725 -10.5060 -0.0008 -0.0004 -0.0003 5.4161 8.0376 17.0013 23.5292
frequency: -6.5719 15.9320 23.3486 34.0443 43.7052 53.7309 66.8939 70.3640 82.6610 97.6877 105.3415 138.6455 169.2597 192.5365 213.4250 223.0414 228.8552 236.4278 247.6245 279.6999 288.4427 301.7853 338.3576 349.3655 386.7796 404.1092 408.8796 413.1617 442.9567 459.7333 484.3532 500.6529 524.5522 569.9750 615.3056 616.1721 622.4817 685.2430 702.5545 709.4675 714.4315 739.9836 750.5043 773.4861 789.4367 792.8833 794.2070 807.7073 851.8562 858.5181 863.1819 913.7374 921.4890 932.7323 956.3804 974.2376 980.8825 984.2670 989.9601 990.7351 991.3680 995.9195 1007.9917 1023.7655 1027.7420 1041.5055 1054.2334 1072.7409 1074.7542 1081.5276 1084.5049 1086.8265 1091.4064 1124.6599 1141.9085 1154.9050 1164.8255 1169.5793 1171.3051 1177.9442 1189.0290 1206.9208 1210.4779 1219.6436 1230.5243 1254.0709 1275.6874 1278.6759 1286.5041 1292.2814 1312.5286 1323.4005 1326.2894 1353.0109 1358.5584 1363.1302 1379.5641 1384.5229 1385.5182 1386.1541 1392.0847 1400.6099 1439.1147 1441.3932 1457.8709 1461.5956 1463.5577 1468.8479 1474.4355 1478.6437 1481.3389 1485.1624 1486.0568 1489.1218 1495.0895 1593.9003 1594.9831 1612.0030 1616.3180 2760.0782 2835.1183 2846.1191 2852.2108 2859.6922 2975.0133 2981.5199 2982.2464 3020.2156 3031.9331 3037.6452 3056.7297 3073.1199 3075.3942 3090.6455 3091.7146 3102.6823 3119.4808 3122.9684 3127.2933 3136.0465 3140.6235 3150.0487 3156.6377 3161.6477 3170.2628 3434.3299 3553.9266
redmass: 3.2531 4.6053 4.1707 3.9084 3.7794 3.2043 3.8337 3.2079 2.2684 3.2269 3.5217 2.7195 2.1275 1.7134 2.3899 1.7845 3.4984 3.8751 2.7203 1.8722 3.8868 2.3116 2.0447 1.4638 3.4056 2.9123 2.9043 4.2985 2.9031 3.2938 3.0286 3.5390 3.9430 3.7128 6.3885 6.3754 3.8852 3.3699 2.1586 1.6036 1.7215 2.5033 1.9686 2.0935 1.4717 1.1696 1.5730 1.5034 2.9255 1.2881 1.2512 1.8959 1.5563 1.5265 2.5359 5.4649 1.4479 1.3709 4.9691 2.4717 4.7228 1.3636 1.3527 2.2106 2.1467 2.3183 2.6851 1.7455 1.8165 1.7928 2.1543 1.9694 2.3300 1.8177 2.2507 1.9083 1.5160 1.0774 1.0554 1.1238 1.1280 2.2836 2.0888 1.6162 1.5308 1.2954 1.1416 1.2389 1.2317 1.2363 1.2826 1.3391 1.3083 1.5771 1.3449 1.3744 3.2255 1.7672 1.2564 1.5752 2.4478 1.8535 2.1234 2.1326 1.0884 1.0580 1.2451 1.0614 1.0745 1.0696 2.1074 1.0744 2.2433 1.0731 1.0859 6.1715 6.1587 6.1447 6.0919 1.0792 1.0718 1.0719 1.0717 1.0712 1.0851 1.0357 1.0357 1.0873 1.0871 1.0846 1.0903 1.0985 1.0980 1.1003 1.1003 1.0880 1.0846 1.0860 1.0885 1.0915 1.0936 1.0950 1.0978 1.1008 1.0974 1.0735 1.0658
irintensity: 0.1696 0.0788 0.0150 0.1429 0.1126 0.1049 0.0265 0.2843 0.0143 1.3602 2.5576 0.6132 1.6450 0.3906 4.5116 1.1315 1.6168 4.4789 4.7847 2.3509 9.6160 0.3736 73.2925 98.3456 4.6050 0.5343 0.0060 1.4594 5.9099 6.1772 3.5484 0.8923 7.1691 35.7881 0.4930 0.2771 22.7335 22.5610 6.9424 110.0231 84.0395 1.7018 20.8194 57.3525 12.1043 6.1088 3.3685 1.4374 1.0226 0.8651 0.1274 0.9512 1.6390 7.1551 16.1288 62.6319 1.9948 2.1528 1.2828 11.6055 0.9952 0.7449 5.9462 12.4349 6.2030 20.1492 15.5525 6.6551 19.7225 16.4182 3.8946 17.5525 20.3903 7.0825 37.7887 75.2937 19.6498 0.7731 0.8634 2.1728 4.0192 19.0837 18.8586 21.2434 17.1354 3.5024 2.3503 4.3868 21.6795 19.8853 6.3176 3.1069 3.0572 22.1358 2.0062 10.5081 5.3642 8.9386 19.5543 15.6210 7.9387 14.8337 10.9409 12.8019 12.3912 3.2406 41.2971 0.7510 8.5594 13.9189 21.6462 6.2746 6.9217 18.6057 2.4492 0.9007 0.5977 4.8108 2.2080 103.3470 65.8262 40.2832 112.3172 225.5130 35.2570 40.4533 23.8249 17.4036 20.7294 14.2946 30.6893 44.4816 77.8660 41.7937 40.2741 11.0019 1.9595 0.7313 4.4135 22.5190 36.2451 25.2579 30.4464 24.4597 8.5998 5.3302 7.8884
temp: 298.150 k
press: 1.00000 atm
elementType: 8 7 7 6 6 6 6 6 6 6 6 6 6 6 6 6 6 6 6 6 6 6 6 1 1 1 1 1 1 1 1 1 1 1 1 1 1 1 1 1 1 1 1 1 1 1 1 1 1 1 1
symmnumber: 1
zpe: 1146988.8 jmol-1
zpe.correction: 0.436865 hartree
zpe.thermalcorrener: 0.459862 hartree
zpe.thermalcorrenthalpy: 0.460806 hartree
zpe.thermalcorrgfe: 0.382158 hartree
zpe.sumelectzpe: -961.873652 hartree
zpe.sumelectthermal: -961.850655 hartree
zpe.sumelectthermalent: -961.849710 hartree
zpe.sumelectthermalfe: -961.928359 hartree
dipole: -1.0969 0.5084 -1.0874
dipole: 1.6260
quadrupole: -138.3460 -137.8850 -126.6165
quadrupole: 11.8745 3.2376 -3.4664
quadrupole: -4.0635 -3.6025 7.6660 11.8745 3.2376 -3.4664
hfenergy: -962.3105165 hartree
pointgroup: C01 [X(C20H28N2O1)]
dipole: -0.4475749 0.2915328 -0.3520495 debye
polarizability: 218.9390852|10.6333713|242.1256733|28.3250811|1.0037316|218.06798 unknown
InChI: InChI=1S/C20H28N2O/c1-3-22(4-2)16-15-21-19(17-11-7-5-8-12-17)20(23)18-13-9-6-10-14-18/h5-14,19-21,23H,3-4,15-16H2,1-2H3
charge 0 multiplicity 1
51 atoms
O  1.299113 -0.965609 -2.903992
N  -0.48992 -0.404795 -0.719235
N  -4.187229 -0.729981 0.08158
C  0.445556 0.619144 -1.198818
C  1.726246 -0.079395 -1.79836
C  -1.884198 0.047455 -0.537853
C  -2.752485 -1.101955 0.012048
C  0.807488 1.644927 -0.12255
C  2.528619 -0.928337 -0.82299
C  -4.887427 -0.906409 -1.219293
C  -4.902223 -1.367262 1.21968
C  0.81328 1.288093 1.247668
C  1.177748 2.961557 -0.492653
C  3.50087 -0.313348 0.003736
C  2.330798 -2.327514 -0.728482
C  -6.107317 0.021501 -1.377595
C  -4.570125 -0.712081 2.573986
C  1.191077 2.229363 2.229839
C  1.563401 3.904524 0.487357
C  1.571141 3.539728 1.854031
C  4.249123 -1.0792 0.925349
C  3.081702 -3.094946 0.189341
C  4.039889 -2.473913 1.023904
H  0.013891 1.197895 -2.065471
H  2.37181 0.73238 -2.193379
H  -2.332191 0.439996 -1.486373
H  -1.903539 0.882329 0.185167
H  -0.426775 -1.251444 -1.301921
H  -2.388299 -1.35057 1.023987
H  -2.594606 -2.020667 -0.611875
H  -4.164156 -0.673897 -2.023237
H  -5.198372 -1.971731 -1.374177
H  -5.987439 -1.263923 1.036782
H  -4.694127 -2.466803 1.268898
H  0.519325 0.267532 1.514921
H  1.154724 3.25496 -1.550947
H  0.845095 -0.413106 -3.590554
H  3.672297 0.767117 -0.068424
H  1.611609 -2.81074 -1.39603
H  -6.878187 -0.17504 -0.610353
H  -5.79441 1.075621 -1.280115
H  -6.578381 -0.121496 -2.368433
H  -3.494123 -0.788457 2.814232
H  -4.836121 0.358977 2.551149
H  -5.13213 -1.202561 3.391021
H  1.19154 1.94205 3.287621
H  1.847029 4.920414 0.189096
H  1.863136 4.270295 2.617149
H  4.995853 -0.588407 1.559658
H  2.923001 -4.177826 0.250339
H  4.622819 -3.070645 1.734865
