program: Gaussian 09
title: 000223883
version: EM64L-G09RevD.01
frameworkgroup: C1[X(C16H14Cl6N2O2)]
method: RPBEPBE
basis: SDD
operation: Freq
keyword: #p
keyword: freq=noraman
keyword: PBEPBE/SDD
title: #p freq=noraman PBEPBE/SDD
converged: YES YES NO NO
title: Mulliken charges:
elementType: Cl Cl Cl Cl Cl Cl O O N N C C C C C C C C C C C C C C C C H H H H H H H H H H H H H H
charge: -0.008881 -0.020931 0.009043 -0.011956 0.003171 -0.014424 -0.378206 -0.394062 -0.241910 -0.462407 -0.382437 -0.333704 -0.611885 -0.467982 0.474975 0.445736 0.235673 0.248889 -0.246523 -0.322231 -0.316523 -0.300796 -0.123654 -0.108253 -0.231041 -0.240665 0.219715 0.198110 0.204918 0.253260 0.279238 0.212966 0.256649 0.257310 0.273489 0.302377 0.287901 0.282345 0.358882 0.413823
chargesum: 0.00000
title: Mulliken charges with hydrogens summed into heavy atoms:
elementType: Cl Cl Cl Cl Cl Cl O O N N C C C C C C C C C C C C C C C C
charge: -0.008881 -0.020931 0.009043 -0.011956 0.003171 -0.014424 -0.019324 0.019762 0.031579 -0.160030 0.035388 0.124474 -0.119681 0.045977 0.474975 0.445736 0.235673 0.248889 -0.246523 -0.322231 -0.316523 -0.300796 -0.123654 -0.108253 0.056860 0.041679
polarizability: 2.82708853e+02 2.85476695e+01 2.94929405e+02 4.66295369e+00 -3.59520776e+00 1.98305081e+02
1716.lowfreq: -4.1680 -2.4661 -0.0019 -0.0016 0.0017 2.1118 8.7172 11.3537 14.4738
frequency: 7.7922 11.2440 14.3934 27.8666 36.2940 64.3124 72.2655 86.0209 91.7822 101.6354 126.5238 131.6609 140.3577 153.7308 166.0630 178.6409 187.2983 200.1563 203.9940 209.1405 249.2068 255.3497 278.4968 284.2447 306.1749 310.3466 319.3100 334.3447 345.6368 350.9187 366.4575 370.1130 381.8174 412.3683 446.4500 449.4623 471.2131 498.1904 523.2167 533.8299 559.8630 583.7770 600.3209 608.8575 615.2704 646.9942 663.1132 700.2104 704.9938 743.0499 760.5435 814.0709 832.5409 854.2736 859.5665 860.8533 872.0396 872.9888 893.7039 920.0235 964.4505 989.6824 1028.4683 1079.4426 1102.9138 1104.1577 1117.9177 1128.4214 1142.3189 1155.5259 1171.0805 1180.4957 1186.4504 1237.4627 1240.1918 1254.5811 1265.2851 1281.1527 1289.0262 1307.5202 1329.7160 1331.8483 1348.1003 1361.7017 1376.9818 1392.0450 1396.9676 1418.2140 1425.0052 1431.8547 1452.1764 1464.6195 1473.1599 1479.0918 1489.1806 1499.7520 1557.5876 1576.1942 1592.1759 1604.2435 2259.4690 2863.3055 2929.5207 2966.3439 2981.9581 2997.1117 3044.4636 3059.0041 3064.9150 3180.5836 3183.5823 3406.0611 3452.3681 3574.9968
redmass: 18.7401 12.8057 15.7794 9.9093 9.8733 18.0832 16.3478 6.7136 2.9863 4.2883 3.1598 4.3566 8.8621 6.1586 4.4915 15.6792 10.8467 14.2818 10.1062 6.5084 3.7129 6.7642 5.3174 5.3349 7.0956 22.7279 2.4763 2.2234 9.8099 10.9070 9.7167 4.8018 3.7789 4.0509 4.8825 4.2305 4.7684 5.2531 5.0585 5.1165 4.9819 4.3744 5.1156 9.5945 2.6564 2.4153 5.4254 7.3922 8.7822 6.3193 7.6669 1.1194 1.2929 5.3651 1.4260 1.3962 7.1758 6.4173 6.3457 2.6682 2.4621 2.0355 3.4615 2.3461 3.5449 2.1540 1.8090 2.0451 3.6971 2.4045 2.5831 2.5478 1.5584 1.3109 1.1818 2.3301 1.8511 1.5147 1.1364 1.2793 2.0345 2.2968 1.4554 4.3963 5.3996 1.5186 7.4198 2.9605 3.6589 1.2777 1.1422 1.0968 1.1970 1.1342 1.1997 1.6855 7.1970 3.3904 9.1477 3.2654 1.0703 1.0702 1.0696 1.0693 1.0600 1.0870 1.1022 1.0940 1.0922 1.0930 1.0933 1.0739 1.0746 1.0654
irintensity: 0.2498 0.4111 0.1472 0.3684 0.1890 0.0413 0.3478 0.3196 1.8974 4.2396 8.3595 1.3789 0.1032 0.8213 0.9331 0.9262 0.6547 0.9232 0.4347 5.9640 8.0153 1.3571 7.5114 6.7154 11.5974 0.1923 39.3692 124.9838 3.7282 2.4642 2.7754 13.8482 2.7113 53.2042 1.9344 5.1006 10.5767 13.7863 7.9137 23.5656 5.5825 27.1354 5.9415 1.3820 42.2078 139.3665 5.9606 40.3548 65.9802 11.6203 11.5316 19.0233 38.6204 1.7644 18.3671 17.8637 10.9984 7.3826 19.6109 35.1811 56.4118 27.1211 8.7352 97.1624 52.1701 28.1946 158.4791 11.4938 78.7824 154.3546 31.5993 20.7685 60.9118 27.3468 40.2987 27.5470 13.8807 12.0315 9.4673 7.2018 22.0780 40.7003 24.8871 29.4364 3.2817 19.5679 11.0569 209.9726 162.7620 146.6729 32.4769 10.4996 59.1539 10.9620 20.4560 44.8848 2.1129 16.6630 1.7160 171.4901 1785.1789 66.2907 35.4252 41.6020 14.3398 28.7822 6.0304 20.3824 5.4995 1.0400 2.0710 1.6622 1.9935 43.6099
temp: 298.150 k
press: 1.00000 atm
elementType: 17 17 17 17 17 17 8 8 7 7 6 6 6 6 6 6 6 6 6 6 6 6 6 6 6 6 1 1 1 1 1 1 1 1 1 1 1 1 1 1
symmnumber: 1
zpe: 716899.4 jmol-1
zpe.correction: 0.273053 hartree
zpe.thermalcorrener: 0.299834 hartree
zpe.thermalcorrenthalpy: 0.300778 hartree
zpe.thermalcorrgfe: 0.210146 hartree
zpe.sumelectzpe: -3636.468608 hartree
zpe.sumelectthermal: -3636.441827 hartree
zpe.sumelectthermalent: -3636.440883 hartree
zpe.sumelectthermalfe: -3636.531515 hartree
dipole: -3.6969 -2.7571 -1.6322
dipole: 4.8921
quadrupole: -225.6321 -205.9999 -191.9314
quadrupole: -2.7714 3.5691 4.0092
quadrupole: -17.7776 1.8545 15.9231 -2.7714 3.5691 4.0092
hfenergy: -3636.741661 hartree
pointgroup: C01 [X(C16H14Cl6N2O2)]
dipole: -1.3682091 -0.9143509 0.998225 debye
polarizability: 279.4490992|14.1710552|201.6569067|-25.8919525|-15.8594871|294.8373341 unknown
InChI: InChI=1S/C16H14Cl6N2O2/c17-9-3-11(19)15(25)7(13(9)21)5-23-1-2-24-6-8-14(22)10(18)4-12(20)16(8)26/h3-4,23-26H,1-2,5-6H2
charge 0 multiplicity 1
40 atoms
Cl -4.876115 -1.341021 2.322789
Cl 4.984407 1.202515 2.897823
Cl -4.496437 2.687223 -2.667782
Cl 5.070993 0.609329 -3.511582
Cl -6.584384 1.436434 2.297213
Cl 7.417023 2.480312 1.14125
O  -3.072033 0.112588 -2.419105
O  2.928557 -0.427396 -1.637016
N  -1.889993 -1.850495 0.589618
N  1.509337 -0.202814 0.457727
C  -0.856895 -0.904376 0.134798
C  0.445893 -1.136709 0.921952
C  -3.147361 -1.881802 -0.182257
C  2.809878 -0.333121 1.205431
C  -3.951833 -0.570436 -0.198829
C  3.934848 0.355188 0.443079
C  -3.865182 0.339023 -1.294015
C  3.948005 0.227064 -0.98856
C  -4.781009 -0.212946 0.893568
C  4.990015 1.043776 1.081402
C  -4.609332 1.545567 -1.273207
C  5.036887 0.778023 -1.711682
C  -5.517389 0.986934 0.907633
C  6.057698 1.590597 0.339193
C  -5.432729 1.873234 -0.185716
C  6.084621 1.451069 -1.063885
H  -0.65552 -1.0922 -0.93904
H  -1.158921 0.169542 0.224879
H  0.254872 -1.020277 2.013176
H  0.791756 -2.171869 0.754247
H  -3.780457 -2.677176 0.245941
H  -2.912565 -2.213266 -1.214822
H  3.023375 -1.418691 1.271887
H  2.733163 0.052826 2.238287
H  -2.069079 -1.79257 1.600964
H  1.17949 0.775478 0.486136
H  -5.999889 2.807117 -0.184007
H  6.911719 1.871895 -1.6411
H  -2.590253 -0.749536 -2.358973
H  2.123739 -0.462231 -0.922814
