program: Gaussian 09
title: 000223839
version: EM64L-G09RevD.01
frameworkgroup: C1[X(C5H6Cl2N2)]
method: RPBEPBE
basis: SDD
operation: Freq
keyword: #p
keyword: freq=noraman
keyword: PBEPBE/SDD
title: #p freq=noraman PBEPBE/SDD
converged: NO NO NO NO
title: Mulliken charges:
elementType: Cl Cl N N C C C C C H H H H H H
charge: -0.017245 -0.017506 -0.234889 0.164653 0.427251 -0.554947 -0.340552 -0.769402 -0.261972 0.348529 0.247443 0.253796 0.251427 0.251416 0.251998
chargesum: 0.00000
title: Mulliken charges with hydrogens summed into heavy atoms:
elementType: Cl Cl N N C C C C C
charge: -0.017245 -0.017506 0.113639 0.164653 0.427251 -0.554947 -0.093108 -0.012763 -0.009975
polarizability: 1.14457130e+02 -6.50832914e+00 8.58826039e+01 1.42954006e-02 -2.16420242e-02 7.10939002e+01
1716.lowfreq: -17.8838 -11.3009 0.0020 0.0029 0.0037 15.5405 35.0790 96.7995 128.3528
frequency: 33.8711 96.7878 128.3514 204.1067 235.9890 274.5792 306.1713 325.7544 384.1716 399.9679 508.3518 568.3222 663.1744 695.4422 783.1852 803.7528 809.4119 872.1115 970.3897 986.9590 1051.3756 1064.8297 1072.0773 1151.8324 1239.1431 1357.2045 1376.3850 1400.0235 1433.2059 1463.9876 1471.2885 1542.9465 1615.5866 2985.5670 3064.7113 3122.5591 3134.4383 3204.1706 3525.1791
redmass: 5.9408 1.2820 2.4634 11.7220 5.2231 4.5461 11.4162 18.6461 3.3511 2.6379 5.9829 3.9403 7.5753 1.5211 4.3803 1.1828 5.3544 6.8701 1.4061 1.6558 1.5468 3.5711 1.8230 3.7092 2.6794 1.3531 2.1702 1.2670 1.9010 1.0429 1.2096 3.7272 5.1914 1.0385 1.0981 1.0979 1.0914 1.0957 1.0778
irintensity: 1.8925 0.5551 0.3058 3.7399 0.4656 1.0381 53.1394 55.7330 1.4306 3.7954 1.9166 40.9740 22.5491 21.7387 243.2044 73.2544 14.2604 160.0128 8.7111 2.3906 15.9085 87.3165 3.9437 19.9263 26.4422 22.3036 19.5867 15.2371 106.1490 19.7456 20.5303 364.7878 117.3208 11.8571 8.8348 9.1756 19.8883 2.3315 41.6343
temp: 298.150 k
press: 1.00000 atm
elementType: 17 17 7 7 6 6 6 6 6 1 1 1 1 1 1
symmnumber: 1
zpe: 277099.2 jmol-1
zpe.correction: 0.105541 hartree
zpe.thermalcorrener: 0.114802 hartree
zpe.thermalcorrenthalpy: 0.115746 hartree
zpe.thermalcorrgfe: 0.069783 hartree
zpe.sumelectzpe: -1223.068372 hartree
zpe.sumelectthermal: -1223.059112 hartree
zpe.sumelectthermalent: -1223.058168 hartree
zpe.sumelectthermalfe: -1223.104131 hartree
dipole: -6.8564 -2.1989 0.0003
dipole: 7.2004
quadrupole: -63.2756 -59.9793 -71.7154
quadrupole: -0.2540 -0.0015 -0.0162
quadrupole: 1.7145 5.0108 -6.7253 -0.2540 -0.0015 -0.0162
hfenergy: -1223.1739134 hartree
pointgroup: C01 [X(C5H6Cl2N2)]
dipole: 2.7937749 -0.4690009 0.0014385 debye
dipolederiv: -0.596698 -0.1793239 0.3162996 -0.3192322 -0.2834734 0.2288313 0.4651607 0.2149594 -0.7943323 -0.5964636 -0.1790435 -0.3160712 -0.3191123 -0.2833752 -0.2287682 -0.4660622 -0.2150614 -0.7957679 -1.0365695 -0.5324895 -0.0001805 0.323956 -0.4007299 0.0004448 -0.0001971 0.0003686 -0.3721628 -0.7769874 0.0148075 -0.0001877 -0.9098359 -0.7738958 -0.0002015 0.0001924 -0.0002429 -0.3038441 0.5190854 0.3064644 -0.0002092 -0.2354439 0.8664445 -0.0004055 -0.0000418 -0.0003207 0.0018949 1.7239969 0.6213824 0.0003586 0.9540735 0.8189747 -0.000042 0.0012098 0.0001371 1.7296158 -0.49319 0.2233035 -0.000249 0.4910327 -0.6727618 0.0001029 0.0000246 0.0000163 -0.2121131 -0.0955191 0.0486847 0.000018 0.1642149 -0.0802914 0.0000057 0.000003 0.0000196 0.0421977 1.033903 -0.2373672 0.0001156 0.0016962 0.5515981 0.0000201 -0.0002772 0.0002026 -0.0539508 0.1860176 0.0221134 -0.0000025 -0.0229389 0.1815783 -0.0000151 -0.0000866 -0.0000193 0.3140308 -0.0480496 -0.0649957 0.0000763 -0.0345828 0.0911526 0.0000238 0.0000636 -0.0000134 0.2116516 -0.0321032 -0.0414586 0.0000559 -0.133325 0.028655 0.0000608 0.0000915 0.0000317 0.1288039 0.0657632 0.0045187 -0.040348 0.0370068 0.0287506 -0.0921536 0.0129816 -0.1120796 -0.0112125 0.0658168 0.0045833 0.0403005 0.037035 0.0288898 0.0921318 -0.0130419 0.11206 -0.0113929 0.0809974 -0.0111795 0.0000236 -0.0345439 -0.1015159 -0.0000354 -0.0000205 -0.0000578 0.1265817 unknown
polarizability: 112.0195891|10.2989532|88.3201757|0.0048735|-0.0025863|71.0938696 unknown
InChI: InChI=1S/C5H6Cl2N2/c1-4-2-3-8-5(6,7)9-4/h2-3,9H,1H3
charge 0 multiplicity 1
15 atoms
Cl -2.067287 -0.793132 1.530703
Cl -2.065477 -0.792097 -1.532503
N  0.215379 -0.896238 0.000607
N  -0.951335 1.224581 0.000477
C  1.457616 -0.288318 0.000111
C  -1.015448 -0.171906 0.000111
C  1.50442 1.103682 -0.000249
C  2.66143 -1.199586 0.000143
C  0.252959 1.807767 0.000123
H  0.145635 -1.917147 0.000954
H  2.456579 1.634671 -0.000555
H  3.587968 -0.606729 -0.000312
H  2.664543 -1.85152 -0.893485
H  2.665005 -1.850858 0.894252
H  0.243811 2.904231 0.000422
