program: Gaussian 09
title: 000217797
version: EM64L-G09RevD.01
frameworkgroup: C1[X(C17H26N4O2)]
method: RPBEPBE
basis: SDD
operation: Freq
keyword: #p
keyword: freq=noraman
keyword: PBEPBE/SDD
title: #p freq=noraman PBEPBE/SDD
converged: YES YES NO NO
title: Mulliken charges:
elementType: O O N N N N C C C C C C C C C C C C C C C C C H H H H H H H H H H H H H H H H H H H H H H H H H H
charge: -0.249425 -0.267286 -0.134248 -0.350768 -0.385819 -0.087313 -0.272249 -0.399306 -0.531454 0.166700 0.231171 -0.397293 -0.337663 -0.389651 -0.310961 0.442988 -0.683285 -0.699040 -0.418783 -0.358110 -0.202902 -0.234432 -0.264990 0.245245 0.276612 0.238999 0.256600 0.252122 0.218529 0.261655 0.303577 0.249470 0.180543 0.307698 0.221721 0.225245 0.185370 0.198758 0.221690 0.218927 0.217966 0.230127 0.217765 0.211684 0.221408 0.304180 0.220111 0.224581 0.223539
chargesum: 0.00000
title: Mulliken charges with hydrogens summed into heavy atoms:
elementType: O O N N N N C C C C C C C C C C C C C C C C C
charge: -0.249425 -0.267286 -0.134248 -0.047191 -0.078121 -0.087313 -0.027004 0.116304 -0.022732 0.166700 0.231171 0.082891 0.092350 0.057316 0.073167 0.442988 -0.024703 -0.039465 -0.197375 -0.053930 0.017209 -0.009850 -0.041452
polarizability: 2.64768184e+02 -1.53591104e+01 2.39418536e+02 -3.35333018e+00 -4.41814332e+00 1.53032479e+02
1716.lowfreq: -26.4000 -2.9413 -0.0009 -0.0007 0.0007 5.6144 7.2159 20.1685 26.7389
frequency: -23.9879 20.0195 26.5088 35.1599 40.4437 50.7257 58.1519 68.3434 71.6177 84.3201 95.8411 123.7114 160.4422 182.5020 195.9568 212.5567 225.1565 236.7734 253.8157 271.7198 280.2815 287.9067 311.5942 329.6093 366.2853 402.9923 411.9252 429.3672 438.8399 480.8795 493.7157 516.7455 523.7597 542.6025 546.0256 606.4751 609.4503 618.3250 639.5353 699.1771 700.4681 744.3184 750.5400 757.5418 759.7842 770.0326 804.5582 814.4249 827.4797 841.9335 846.8773 897.0753 905.5472 916.2809 945.5180 966.7922 975.0832 980.9925 992.3140 1008.0257 1024.1200 1028.5870 1039.7558 1052.0121 1062.9288 1067.6178 1074.7762 1081.1905 1090.4459 1094.4510 1116.0903 1155.2190 1170.1367 1175.2154 1192.0243 1195.6362 1203.6281 1206.1462 1223.1397 1229.1610 1254.2989 1257.7811 1280.2336 1282.4343 1293.7071 1306.5431 1316.2537 1325.6627 1332.0246 1335.2727 1342.6946 1365.9521 1368.8505 1376.1340 1376.3578 1389.9949 1392.5839 1439.0732 1443.2099 1451.5968 1458.3438 1465.7632 1472.4401 1477.2403 1481.2483 1482.2658 1486.2684 1488.9754 1490.6214 1498.1154 1503.9779 1599.6958 1611.4324 1617.9988 1644.8405 2856.5963 2880.0973 2975.6100 2985.5919 2988.1783 2994.7632 3003.3766 3011.4962 3021.9117 3031.0348 3041.0645 3048.4390 3072.4304 3076.7841 3079.8365 3080.6125 3084.2395 3090.6726 3098.0182 3116.1435 3127.5319 3138.2734 3147.7848 3164.2313 3471.2949 3545.2139
redmass: 3.2471 4.6984 4.8630 4.6825 4.7522 4.1926 2.5163 3.6878 3.9136 3.9463 3.6402 4.3234 1.5035 3.1808 4.0892 1.1650 2.7884 2.3718 3.0904 1.8198 3.4829 1.9948 3.4145 3.3629 3.6054 2.3597 2.9793 3.6829 2.3181 2.9867 3.8926 2.5262 2.7369 1.6349 2.7150 4.1794 4.6949 4.9872 5.6812 3.6781 2.5712 2.0400 3.7317 1.7190 1.8518 1.1515 1.2210 3.6898 2.7818 1.4961 2.4253 2.0207 1.4060 1.7035 2.8830 1.3429 2.4590 5.6962 1.3069 3.2178 2.4057 2.8301 3.1465 2.3058 2.3488 1.9831 2.2335 2.2628 2.1427 1.7042 1.6492 1.1674 1.0507 1.6773 1.2460 1.1472 1.6321 2.0750 1.8872 2.3877 1.6695 2.5179 1.2853 1.3721 1.1320 2.6944 1.3301 1.6857 1.4190 1.3340 1.2246 1.3390 1.2699 2.1996 1.4235 1.2436 4.0501 2.2054 1.1325 1.0870 1.0632 1.0497 1.0559 1.0658 1.0610 1.1436 2.0679 1.0764 1.8255 1.0792 1.5261 5.2728 6.3798 6.2189 10.3487 1.0710 1.0705 1.0348 1.0364 1.0659 1.0614 1.0855 1.0657 1.0623 1.0819 1.1000 1.0895 1.0989 1.1008 1.0989 1.0994 1.1004 1.1006 1.1045 1.0861 1.0868 1.0925 1.0962 1.1015 1.0754 1.0779
irintensity: 0.0690 0.5164 0.7471 4.6661 1.7689 1.4769 0.1727 1.7391 3.9181 4.8363 2.2822 2.0499 1.5138 1.6744 3.1991 0.3025 10.8312 9.3354 1.8257 0.9201 2.9385 1.5382 5.9909 29.9576 14.1200 0.8644 0.4663 4.8350 111.9686 5.8470 11.1899 42.6736 12.0227 53.2924 16.9889 1.8805 5.0136 16.4937 9.8915 19.4915 15.8594 7.4014 3.1934 78.8935 6.5787 6.4337 7.2131 16.7181 4.8832 4.4453 10.6776 1.9068 9.6564 4.9592 11.5058 0.1096 8.8562 3.1997 1.7610 3.0185 4.2307 5.2199 22.4352 11.7623 7.9399 20.3588 29.8582 18.9332 40.7703 7.4539 7.0207 0.6755 1.1135 17.7446 25.3193 11.0519 39.4930 28.6276 78.4501 2.8572 36.4717 111.2092 2.4884 11.3877 20.7076 18.3084 3.5433 6.5573 5.5722 2.4603 10.5715 2.3436 22.1244 9.8945 14.8777 24.1645 4.2090 7.9819 40.9082 15.4960 17.4510 12.6934 4.0761 6.6979 5.9995 15.3228 129.5231 13.3696 169.3073 0.3897 25.1891 12.9525 48.6022 259.7123 299.2337 84.3516 97.9550 27.1757 27.3816 45.6215 42.9883 24.1220 18.4202 28.9973 35.5195 4.8199 15.5857 42.4833 75.5349 4.5457 42.4716 7.4367 40.7265 13.8843 8.4763 6.7336 43.3040 2.2740 36.8296 25.7104 20.9768
temp: 298.150 k
press: 1.00000 atm
elementType: 8 8 7 7 7 7 6 6 6 6 6 6 6 6 6 6 6 6 6 6 6 6 6 1 1 1 1 1 1 1 1 1 1 1 1 1 1 1 1 1 1 1 1 1 1 1 1 1 1
symmnumber: 1
zpe: 1085480.9 jmol-1
zpe.correction: 0.413438 hartree
zpe.thermalcorrener: 0.436719 hartree
zpe.thermalcorrenthalpy: 0.437664 hartree
zpe.thermalcorrgfe: 0.357954 hartree
zpe.sumelectzpe: -1031.082069 hartree
zpe.sumelectthermal: -1031.058787 hartree
zpe.sumelectthermalent: -1031.057843 hartree
zpe.sumelectthermalfe: -1031.137553 hartree
dipole: 5.3276 -2.8262 3.6384
dipole: 7.0433
quadrupole: -130.4836 -129.4705 -145.1051
quadrupole: -8.0450 -8.2336 -10.1270
quadrupole: 4.5361 5.5492 -10.0853 -8.0450 -8.2336 -10.1270
hfenergy: -1031.4955068 hartree
pointgroup: C01 [X(C17H26N4O2)]
dipole: -1.9291327 1.0114697 1.712931 debye
polarizability: 260.4842118|-18.3488172|237.3598239|-0.7953589|23.5470149|159.3751629 unknown
InChI: InChI=1S/C17H26N4O2/c1-3-20(4-2)11-10-18-17(23)14-12-16(22)21(13-14)19-15-8-6-5-7-9-15/h5-9,14,18-19H,3-4,10-13H2,1-2H3
charge 0 multiplicity 1
49 atoms
O  3.677418 2.383041 -0.758066
O  -0.26041 -0.283866 0.190827
N  2.917705 0.71682 0.723366
N  -1.441579 1.692134 0.486382
N  4.056002 -0.095117 0.623976
N  -4.780458 -0.024474 -0.158302
C  0.825532 1.558394 1.448081
C  1.926744 0.521926 1.803624
C  1.566051 2.637395 0.587375
C  2.826375 1.937514 0.061634
C  -0.327829 0.89444 0.660606
C  -2.626638 1.228313 -0.262019
C  -3.572489 0.352589 0.604031
C  -5.191472 -1.442471 -0.010987
C  -5.868194 0.97985 -0.065504
C  3.977043 -1.328252 -0.093279
C  -5.76754 -1.850467 1.372921
C  -6.96091 0.80169 -1.135995
C  5.183899 -2.045141 -0.314654
C  2.740184 -1.869297 -0.530335
C  5.151997 -3.289007 -0.976492
C  2.7274 -3.121569 -1.184248
C  3.923144 -3.840131 -1.413305
H  0.409458 2.010811 2.366744
H  1.531602 -0.506397 1.782443
H  2.386937 0.721214 2.790902
H  0.970139 3.015148 -0.260058
H  1.874399 3.508242 1.195012
H  -3.165622 2.111411 -0.649398
H  -2.287242 0.626774 -1.121198
H  -1.457384 2.620141 0.912943
H  -3.015059 -0.558003 0.887483
H  -3.814124 0.894902 1.550642
H  4.908089 0.459181 0.476274
H  -5.932541 -1.672925 -0.798536
H  -4.304063 -2.064488 -0.233733
H  -6.34233 0.993789 0.94924
H  -5.406502 1.977439 -0.200777
H  -5.040485 -1.655379 2.18292
H  -6.002497 -2.931156 1.383309
H  -6.698553 -1.302696 1.608482
H  -6.508772 0.774488 -2.143141
H  -7.536234 -0.129983 -0.990274
H  -7.676507 1.643231 -1.092621
H  6.138048 -1.629015 0.032229
H  1.804509 -1.319569 -0.381284
H  6.08951 -3.830146 -1.149037
H  1.76858 -3.530742 -1.52287
H  3.900865 -4.808282 -1.924727
