program: Gaussian 09
title: 000223828
version: EM64L-G09RevD.01
frameworkgroup: C1[X(C16H10O2)]
method: RPBEPBE
basis: SDD
operation: Freq
keyword: #pfreq=noraman
keyword: PBEPBE/SDD
title: #p freq=noraman PBEPBE/SDD
converged: YES YES NO NO
title: Mulliken charges:
elementType: O O C C C C C C C C C C C C C C C C H H H H H H H H H H
charge: -0.184463 -0.204811 0.392313 0.373392 0.386709 -0.590225 0.262117 -0.368252 -0.433091 -0.416148 -0.406565 0.020356 -0.489879 -0.242388 -0.235308 0.156072 -0.262214 -0.278566 0.253481 0.266079 0.240241 0.242659 0.243070 0.279158 0.232693 0.232037 0.264109 0.267423
chargesum: 0.00000
title: Mulliken charges with hydrogens summed into heavy atoms:
elementType: O O C C C C C C C C C C C C C C C C
charge: -0.184463 -0.204811 0.392313 0.373392 0.386709 -0.336745 0.262117 -0.102172 -0.192850 -0.173488 -0.163496 0.020356 -0.210721 -0.009695 -0.003270 0.156072 0.001894 -0.011142
polarizability: 3.53520267e+02 1.40085751e+01 1.93161021e+02 -7.05521126e+00 4.44063306e+00 7.99026779e+01
1716.lowfreq: -3.6798 -0.0004 0.0002 0.0004 1.9333 6.0308 43.9848 53.9624 68.3823
frequency: 43.9659 53.9579 68.3789 104.6756 157.5653 184.3308 218.0984 235.9004 271.3530 300.1288 378.2653 401.8112 408.2969 441.9547 450.6708 478.9826 492.0095 511.9008 520.4798 582.6755 609.9213 617.2809 649.2887 667.7496 753.0588 760.3347 771.7391 779.0323 784.3350 796.0543 827.4961 846.6155 870.5298 881.5809 912.4445 922.9606 932.2430 962.5240 978.1839 995.1414 997.9950 998.3727 1023.6573 1083.6229 1129.8894 1170.1170 1175.5770 1187.9011 1221.7416 1243.6795 1270.1242 1279.8540 1282.9905 1329.3829 1352.3297 1362.1937 1405.4502 1422.0239 1437.7229 1463.1174 1506.7845 1518.2630 1552.8130 1568.4328 1576.6531 1600.6205 1630.9885 1640.2939 3123.3922 3125.4060 3128.9339 3133.6612 3143.9028 3146.0457 3147.3848 3164.7977 3169.7792 3190.2609
redmass: 5.8216 4.9239 5.9302 8.3597 5.9056 3.9610 5.5218 7.5335 4.7822 5.1557 3.5455 8.2508 3.8583 3.7419 11.1207 2.5119 5.0914 6.7536 3.7663 5.1529 3.2305 6.5496 6.5942 2.7281 2.0377 2.4970 3.6495 2.8178 2.9141 5.0285 1.4383 1.9689 2.3651 2.2073 1.6361 1.7258 4.3051 1.3805 1.4013 1.3675 1.7689 1.8730 2.2227 1.6917 1.6765 1.2668 1.1238 1.5798 1.5652 1.9054 1.8911 2.3858 1.8576 2.6652 1.9627 2.1159 4.3561 3.3985 4.6289 2.3856 3.6653 9.4174 8.3856 6.5508 8.3614 5.6592 6.7730 6.9907 1.0869 1.0904 1.0892 1.0901 1.0869 1.0950 1.0919 1.1004 1.1012 1.0945
irintensity: 0.4151 1.4698 3.6615 5.3497 1.8451 1.0555 3.0240 0.5740 0.4267 0.0785 0.5801 46.1318 1.6100 3.5278 0.7792 21.0734 1.7454 0.2432 0.7019 1.0883 1.7353 1.9681 2.5232 3.6899 17.5815 23.3116 19.8362 2.3086 0.0101 6.0198 29.0648 22.2025 10.2291 33.9194 42.0123 6.1027 12.6866 1.9884 7.5470 0.5030 3.0332 6.4989 5.3896 130.8287 10.0532 7.0192 1.3871 10.2289 14.8724 6.2286 73.6015 62.3550 6.1526 64.9636 17.3851 6.4148 12.2059 16.5163 0.0850 10.0713 15.9957 45.8712 323.0905 90.4583 138.8100 4.0568 38.4968 2.0576 0.6471 7.9789 0.5085 8.3700 0.9172 28.6219 6.1941 43.3427 12.1474 3.1867
temp: 298.150 k
press: 1.00000 atm
elementType: 8 8 6 6 6 6 6 6 6 6 6 6 6 6 6 6 6 6 1 1 1 1 1 1 1 1 1 1
symmnumber: 1
zpe: 547471.4 jmol-1
zpe.correction: 0.208521 hartree
zpe.thermalcorrener: 0.222191 hartree
zpe.thermalcorrenthalpy: 0.223135 hartree
zpe.thermalcorrgfe: 0.167348 hartree
zpe.sumelectzpe: -764.925068 hartree
zpe.sumelectthermal: -764.911398 hartree
zpe.sumelectthermalent: -764.910454 hartree
zpe.sumelectthermalfe: -764.966241 hartree
dipole: -2.2184 -0.5407 -0.0708
dipole: 2.2844
quadrupole: -88.2898 -108.6386 -107.0629
quadrupole: -10.2519 3.0724 8.2545
quadrupole: 13.0407 -7.3081 -5.7325 -10.2519 3.0724 8.2545
hfenergy: -765.133589 hartree
pointgroup: C01 [X(C16H10O2)]
dipole: -0.8722873 0.1306301 0.1726464 debye
polarizability: 353.7933359|-9.6903371|144.5178487|-9.1858907|56.2941465|128.272781 unknown
InChI: InChI=1S/C16H10O2/c17-14-7-8-16(18)15(10-14)13-6-5-11-3-1-2-4-12(11)9-13/h1-10H
charge 0 multiplicity 1
28 atoms
O  2.022868 2.375451 0.900787
O  4.137131 -2.189985 -1.213133
C  0.122567 0.206033 0.27269
C  -2.164095 -0.396338 -0.470325
C  -2.722939 0.29255 0.676086
C  -0.746356 -0.422601 -0.640617
C  1.590014 0.115754 0.075049
C  -0.446965 0.901404 1.400555
C  -1.825271 0.932342 1.593961
C  -3.052634 -1.030165 -1.403819
C  -4.144579 0.315107 0.849425
C  2.482431 1.282344 0.439413
C  2.182736 -1.013017 -0.457264
C  -4.434445 -0.992156 -1.208994
C  -4.984808 -0.314647 -0.073089
C  3.632964 -1.132645 -0.703956
C  3.948751 1.143722 0.21938
C  4.497224 0.018627 -0.324527
H  -0.336942 -0.917876 -1.529703
H  0.215794 1.40321 2.108041
H  -2.240929 1.45465 2.463538
H  -2.629518 -1.547753 -2.273065
H  -4.565739 0.836036 1.717313
H  1.590852 -1.902677 -0.69995
H  -5.105551 -1.479156 -1.924541
H  -6.071036 -0.291661 0.066971
H  4.548769 2.013018 0.51078
H  5.572308 -0.092074 -0.504705
