program: Gaussian 09
title: 000217796
version: EM64L-G09RevD.01
frameworkgroup: C1[X(C16H24N4O2)]
method: RPBEPBE
basis: SDD
operation: Freq
keyword: #p
keyword: freq=noraman
keyword: PBEPBE/SDD
title: #p freq=noraman PBEPBE/SDD
converged: YES YES NO NO
title: Mulliken charges:
elementType: O O N N N N C C C C C C C C C C C C C C C C H H H H H H H H H H H H H H H H H H H H H H H H
charge: -0.248980 -0.276584 -0.137233 -0.357401 -0.385047 -0.096828 -0.264350 -0.400404 -0.534907 0.162696 0.233430 -0.386025 -0.361930 -0.349490 0.444190 -0.419604 -0.355620 -0.618667 -0.630989 -0.202173 -0.224793 -0.268564 0.254730 0.240259 0.280046 0.253971 0.248205 0.298913 0.277841 0.217329 0.307080 0.188632 0.203509 0.227818 0.196079 0.221195 0.296393 0.225902 0.190065 0.215615 0.212156 0.270623 0.188270 0.220689 0.219914 0.224040
chargesum: 0.00000
title: Mulliken charges with hydrogens summed into heavy atoms:
elementType: O O N N N N C C C C C C C C C C C C C C C C
charge: -0.248980 -0.276584 -0.137233 -0.058488 -0.077967 -0.096828 -0.009620 0.119901 -0.032732 0.162696 0.233430 0.109145 0.030210 0.074407 0.444190 -0.198410 -0.059227 0.012915 0.040060 0.018516 -0.004878 -0.044523
polarizability: 2.32274716e+02 -2.20724410e+01 2.31207509e+02 -7.49724991e+00 -1.18069916e+01 1.49449920e+02
1716.lowfreq: -8.5096 -3.7780 0.0001 0.0003 0.0006 5.1272 14.8419 17.8813 33.3458
frequency: 14.5272 17.8612 33.2625 44.5650 52.8589 54.1965 67.9445 77.0747 95.5142 106.4199 139.4291 188.6197 198.3823 215.5318 224.7111 233.4625 244.1482 271.7325 277.1677 303.1679 310.4350 340.4142 372.6666 398.7520 406.0109 410.0063 445.0747 453.4138 486.2661 515.1423 524.2548 543.5532 581.5584 600.5800 608.5800 615.1020 633.1103 690.4897 697.5703 739.5077 753.5988 756.8518 795.6901 822.4857 827.3802 832.2754 838.8431 885.7329 900.2223 912.8318 926.4633 964.2468 967.2933 980.3990 987.3761 1011.2207 1023.0404 1032.2872 1037.2400 1039.6237 1059.3474 1070.3813 1079.3086 1089.0087 1091.6921 1093.4909 1135.8408 1155.7458 1158.4728 1170.2163 1189.5782 1193.9981 1199.3731 1211.2829 1228.5204 1230.9759 1256.4452 1267.7481 1271.8727 1283.8655 1298.7898 1305.2501 1317.8085 1329.4546 1340.4379 1345.1656 1365.1989 1375.4423 1391.2856 1420.4057 1438.0742 1440.6104 1449.6715 1451.1590 1462.4868 1464.3393 1470.5480 1477.4661 1480.8606 1481.9010 1485.5007 1486.0662 1498.8381 1505.3610 1599.6865 1612.3072 1618.2247 1644.2173 2847.8150 2861.7786 2878.2893 2976.0402 2988.7285 3003.0240 3010.3252 3016.2412 3020.5417 3029.1353 3033.6396 3047.4329 3072.8249 3078.8477 3082.0550 3084.6138 3087.7955 3115.4135 3124.8777 3137.8158 3146.8566 3163.5536 3470.1131 3529.2116
redmass: 4.3706 4.8806 4.0361 3.4849 4.0017 4.2425 4.1054 6.6508 3.7727 4.2232 3.7236 3.9324 3.5195 1.2153 1.8105 3.0237 1.4531 3.6231 2.5002 2.5024 3.3738 3.3942 2.8462 2.0126 2.0637 2.9361 2.2106 2.4221 3.7572 2.6680 3.2315 3.1989 1.6025 3.0714 3.4000 4.9784 6.2408 5.5482 2.0199 2.7635 3.5682 1.8527 3.1914 3.2841 2.5480 2.5579 1.6270 2.5361 1.4185 1.7724 2.2046 1.3610 2.1972 4.5504 1.3875 2.2981 2.4485 2.1118 2.9292 1.5015 2.1241 2.0116 2.2840 2.4298 1.3672 1.6673 1.4191 1.5110 1.1767 1.0505 1.2408 1.1650 1.4077 1.6127 2.2783 1.8688 3.3971 1.8577 1.9110 1.4266 1.3271 2.5585 1.8395 1.3931 1.3075 1.4147 1.3312 2.5581 4.2398 1.1417 2.1832 1.1601 1.0951 1.0971 1.0881 1.0571 1.0708 1.0855 1.0557 1.1651 1.0985 1.9019 1.8047 1.5114 5.1778 6.3107 6.2761 10.3029 1.0573 1.0605 1.0663 1.0611 1.0662 1.0643 1.0645 1.0722 1.0752 1.0941 1.0833 1.0931 1.1006 1.1013 1.0996 1.0994 1.0996 1.0863 1.0868 1.0926 1.0962 1.1013 1.0754 1.0770
irintensity: 0.2632 0.5588 1.6775 2.0422 1.1220 0.8672 1.1017 8.7528 3.3599 3.1517 4.7535 0.7971 2.0612 0.1832 1.2688 15.4248 0.4747 1.5173 5.2480 5.6929 15.7845 21.3554 4.2652 5.5957 2.7041 0.5678 98.6684 18.0160 4.8131 8.6734 4.9284 3.1258 84.0120 15.0906 17.0452 13.5377 10.5818 8.0165 31.6785 10.1215 3.7631 85.4823 1.8725 29.3500 4.2368 2.8217 2.6161 3.2991 8.8591 3.4637 5.2724 0.7092 13.7874 3.1703 1.4487 24.9580 3.6223 8.9588 13.1218 11.2009 12.5091 14.7052 3.5833 28.9704 11.7762 7.5171 4.0427 3.7833 1.2933 1.5436 16.9757 9.3865 6.6426 21.6653 1.3948 118.6791 133.4880 6.1670 9.5630 3.5606 1.3753 19.6853 9.0741 4.9994 5.6185 5.3684 8.4024 11.3134 4.7107 2.4328 6.3563 6.8281 35.1658 9.3404 31.5976 14.1584 9.2066 22.9564 25.0534 7.3203 20.0912 71.2214 147.0444 24.4685 14.0221 21.5908 281.1636 277.3157 100.3584 77.4750 186.9726 47.0156 49.3337 53.4009 18.2058 37.8314 42.5721 17.2710 32.4085 63.9312 34.7077 3.1819 8.1324 5.5025 24.9417 9.6419 9.2077 39.3320 1.9595 34.7474 25.1514 16.5398
temp: 298.150 k
press: 1.00000 atm
elementType: 8 8 7 7 7 7 6 6 6 6 6 6 6 6 6 6 6 6 6 6 6 6 1 1 1 1 1 1 1 1 1 1 1 1 1 1 1 1 1 1 1 1 1 1 1 1
symmnumber: 1
zpe: 1012811.5 jmol-1
zpe.correction: 0.385760 hartree
zpe.thermalcorrener: 0.408184 hartree
zpe.thermalcorrenthalpy: 0.409128 hartree
zpe.thermalcorrgfe: 0.331089 hartree
zpe.sumelectzpe: -991.858041 hartree
zpe.sumelectthermal: -991.835617 hartree
zpe.sumelectthermalent: -991.834672 hartree
zpe.sumelectthermalfe: -991.912712 hartree
dipole: 3.5699 -3.4733 -1.5081
dipole: 5.2040
quadrupole: -117.3059 -113.7184 -146.1858
quadrupole: -5.3966 3.9841 8.8713
quadrupole: 8.4308 12.0183 -20.4491 -5.3966 3.9841 8.8713
hfenergy: -992.2438009 hartree
pointgroup: C01 [X(C16H24N4O2)]
dipole: -1.6014435 -1.1745611 0.4977522 debye
polarizability: 239.0067941|21.0878302|222.2746999|-3.4319059|18.2782456|151.6506511 unknown
InChI: InChI=1S/C16H24N4O2/c1-19(2)10-6-9-17-16(22)13-11-15(21)20(12-13)18-14-7-4-3-5-8-14/h3-5,7-8,13,17-18H,6,9-12H2,1-2H3
charge 0 multiplicity 1
46 atoms
O  1.16645 -2.199542 -2.547222
O  -1.077597 -0.203162 1.321384
N  1.398088 -1.905832 -0.220535
N  -2.914348 -1.434733 0.589451
N  2.740602 -1.503038 -0.262535
N  -3.171973 2.484857 -0.124259
C  -0.718943 -2.55198 0.610429
C  0.754202 -2.327247 1.043938
C  -0.623768 -2.886586 -0.915664
C  0.713223 -2.285457 -1.371599
C  -1.572694 -1.284697 0.875703
C  -3.926302 -0.370362 0.763476
C  -4.326502 0.311458 -0.566471
C  -3.248736 1.317933 -1.035252
C  3.071218 -0.133798 -0.026659
C  4.404127 0.282636 -0.290378
C  2.134197 0.787756 0.508291
C  -4.168143 3.526825 -0.434096
C  -1.807873 3.030614 0.036787
C  4.790234 1.612828 -0.030272
C  2.54124 2.115304 0.768397
C  3.863268 2.54024 0.503765
H  -1.164276 -3.393929 1.170822
H  1.223172 -3.253989 1.428126
H  0.831124 -1.531825 1.802062
H  -0.598256 -3.977316 -1.096678
H  -1.444076 -2.465935 -1.520878
H  -3.231084 -2.334096 0.219585
H  -3.496109 0.397315 1.430169
H  -4.810424 -0.814131 1.258778
H  3.252215 -1.963013 -1.025399
H  -4.504842 -0.451013 -1.352608
H  -5.28592 0.84296 -0.413867
H  -2.264784 0.814583 -1.037232
H  -3.453234 1.626494 -2.090525
H  5.130162 -0.43301 -0.696167
H  1.101946 0.482304 0.709315
H  -4.15659 4.299548 0.355712
H  -3.984754 4.034099 -1.416302
H  -5.183723 3.092413 -0.463938
H  -1.818281 3.816833 0.814331
H  -1.134813 2.224562 0.374221
H  -1.391301 3.480802 -0.899278
H  5.818841 1.925257 -0.244332
H  1.810355 2.821524 1.179893
H  4.167084 3.572546 0.707012
