program: Gaussian 09
title: 000223829
version: EM64L-G09RevD.01
frameworkgroup: C1[X(C16H13NO)]
method: RPBEPBE
basis: SDD
operation: Freq
keyword: #p
keyword: freq=noraman
keyword: PBEPBE/SDD
title: #p freq=noraman PBEPBE/SDD
converged: YES YES NO NO
title: Mulliken charges:
elementType: O N C C C C C C C C C C C C C C C C H H H H H H H H H H H H H
charge: -0.432294 -0.113699 0.217925 0.197153 0.455443 0.418301 -0.528241 0.361713 -0.479564 -0.477482 -0.472857 -0.370015 -0.401967 -0.434554 -0.260359 0.095410 -0.247593 -0.805111 0.266749 0.238599 0.235179 0.238294 0.231016 0.241363 0.239452 0.228103 0.229111 0.284777 0.237816 0.237313 0.370020
chargesum: 0.00000
title: Mulliken charges with hydrogens summed into heavy atoms:
elementType: O N C C C C C C C C C C C C C C C C
charge: -0.062274 -0.113699 0.217925 0.197153 0.455443 0.418301 -0.261492 0.361713 -0.240966 -0.242304 -0.234563 -0.139000 -0.160603 -0.195102 -0.032256 0.095410 -0.018482 -0.045205
polarizability: 3.18838287e+02 5.87320350e+00 2.28472802e+02 -1.09263737e-01 3.40371635e-02 7.42140089e+01
1716.lowfreq: -9.3386 -8.0294 -0.0008 -0.0005 -0.0004 3.7133 17.3672 57.4832 101.7144
frequency: 17.1945 57.4760 101.7132 102.5911 131.7791 143.0792 224.0313 232.5620 243.8070 292.2276 306.6870 345.8124 397.3082 401.4018 414.6522 428.8255 437.6633 486.2353 503.5288 515.1436 533.2297 568.8451 583.8090 622.5436 643.5888 701.8033 711.5938 731.5999 748.8789 759.5829 806.5460 816.5445 845.0545 863.3648 869.3314 888.3395 892.1590 940.9196 957.4161 967.9406 982.0023 985.7678 992.8196 1018.1748 1037.1354 1040.3228 1084.3453 1103.3861 1155.7820 1172.3617 1177.9548 1230.2468 1235.4595 1241.0755 1254.1963 1281.2865 1300.4425 1339.9878 1381.5181 1390.8787 1396.2979 1413.7987 1426.9243 1447.8945 1453.2591 1462.6986 1480.3400 1509.4023 1523.4746 1562.3625 1579.3509 1611.3633 1625.8325 1628.9112 2990.7971 3067.9327 3117.7899 3121.3692 3125.8123 3133.6255 3134.0582 3143.1807 3150.3306 3160.1647 3164.2989 3172.9314 3573.9414
redmass: 3.5504 4.3516 5.7728 3.5013 3.5041 1.2098 5.1907 5.2624 4.0994 4.3711 4.5550 4.5449 2.0233 4.7736 6.0568 2.7545 1.7683 4.5331 2.6207 5.8892 2.8264 3.0734 6.1784 7.0760 3.2896 4.7555 5.8215 2.3328 4.9339 1.3646 2.0917 1.4367 6.1297 1.7233 4.1825 1.7343 7.9807 1.6388 1.3533 1.3769 2.2091 1.3957 1.3765 3.4474 1.5925 2.0821 2.5009 2.0915 1.3302 1.2490 1.0879 1.9362 1.8805 1.8830 1.5723 1.4930 1.9364 2.2214 2.0981 1.8977 4.3425 2.2463 4.1713 3.2793 2.6571 1.1039 1.0482 3.7580 3.5380 5.7109 6.6117 5.8232 6.6782 6.7802 1.0390 1.0974 1.0862 1.0864 1.0885 1.0887 1.0966 1.0983 1.0941 1.0949 1.0992 1.0906 1.0673
irintensity: 0.1385 0.3220 0.4338 1.0411 0.5856 0.6637 1.9620 0.6329 0.0946 0.2998 2.2829 0.2114 49.4323 16.0679 1.5764 36.3663 63.0281 3.0345 5.6627 4.5458 5.2453 8.7850 21.0714 4.6119 15.6297 9.5089 6.3775 0.0017 6.5133 61.2977 0.3789 5.0431 31.5163 88.6275 3.7514 9.3161 119.4714 12.1257 4.3855 4.9562 74.7123 0.0751 0.0069 6.9569 0.4232 8.7364 0.3729 3.6170 2.1182 3.7429 1.3728 5.0909 43.8939 86.7021 28.9283 1.5820 5.4230 3.7034 2.9858 49.1342 3.5270 0.8446 15.2365 1.0998 6.6198 19.5799 21.0752 8.6908 4.8486 2.5800 3.9946 4.6650 0.3763 1.7420 10.0878 13.9606 0.5892 3.2451 10.1664 5.6917 9.6330 35.4777 33.1988 16.4016 28.8442 4.9314 80.2926
temp: 298.150 k
press: 1.00000 atm
elementType: 8 7 6 6 6 6 6 6 6 6 6 6 6 6 6 6 6 6 1 1 1 1 1 1 1 1 1 1 1 1 1
symmnumber: 1
zpe: 638926.1 jmol-1
zpe.correction: 0.243354 hartree
zpe.thermalcorrener: 0.258003 hartree
zpe.thermalcorrenthalpy: 0.258947 hartree
zpe.thermalcorrgfe: 0.200876 hartree
zpe.sumelectzpe: -746.224116 hartree
zpe.sumelectthermal: -746.209467 hartree
zpe.sumelectthermalent: -746.208523 hartree
zpe.sumelectthermalfe: -746.266594 hartree
dipole: -0.1215 0.3813 0.0092
dipole: 0.4003
quadrupole: -91.3917 -85.8893 -111.6775
quadrupole: 0.5672 0.0055 0.0221
quadrupole: 4.9278 10.4302 -15.3580 0.5672 0.0055 0.0221
hfenergy: -746.4674698 hartree
pointgroup: C01 [X(C16H13N1O1)]
dipole: -0.0435588 0.1513399 0.0018834 debye
polarizability: 318.8536712|3.2720041|228.2092901|7.7839811|-0.1770628|74.4621367 unknown
InChI: InChI=1S/C16H13NO/c1-11(17-18)14-9-8-13-7-6-12-4-2-3-5-15(12)16(13)10-14/h2-10,18H,1H3
charge 0 multiplicity 1
31 atoms
O  4.682534 -2.348808 0.194931
N  3.358633 -1.722986 0.145084
C  -0.341207 0.301488 0.039437
C  -1.623657 -0.414049 0.001653
C  -0.345296 1.746524 0.032802
C  -2.850487 0.345178 -0.041173
C  0.91064 -0.369715 0.083132
C  2.139015 0.328252 0.12023
C  -1.597416 2.465466 -0.010718
C  -2.802728 1.791343 -0.046374
C  0.898687 2.445116 0.070154
C  -1.716588 -1.839271 0.005299
C  2.11543 1.759687 0.113252
C  -4.105728 -0.337206 -0.078217
C  -2.95837 -2.489958 -0.031371
C  3.439919 -0.400647 0.166723
C  -4.165676 -1.735786 -0.073573
C  4.741807 0.370784 0.233848
H  0.957959 -1.461292 0.089811
H  -1.570383 3.561504 -0.014768
H  -3.749611 2.343267 -0.079532
H  0.886814 3.541508 0.064512
H  -0.80653 -2.445847 0.03719
H  3.051803 2.324931 0.140861
H  -5.027371 0.256295 -0.11061
H  -2.999771 -3.584701 -0.027597
H  -5.132542 -2.249819 -0.102281
H  5.596544 -0.317758 0.287656
H  4.860128 1.011903 -0.659147
H  4.757409 1.028976 1.121734
H  4.45224 -3.312478 0.17225
