program: Gaussian 09
title: 000019021
version: EM64L-G09RevD.01
frameworkgroup: C1[X(C11H14N4O3)]
method: RPBEPBE
basis: SDD
operation: Freq
keyword: #p
keyword: freq=noraman
keyword: PBEPBE/SDD
title: #p freq=noraman PBEPBE/SDD
converged: YES YES NO NO
title: Mulliken charges:
elementType: O O O N N N N C C C C C C C C C C C H H H H H H H H H H H H H H
charge: -0.209619 -0.218045 -0.252149 0.028207 0.025278 -0.418353 -0.648614 -0.505527 -0.543904 0.478252 0.191984 -0.385087 -0.346337 -0.390371 -0.375840 0.372318 -0.814851 0.301719 0.215281 0.242398 0.253290 0.213189 0.304264 0.239223 0.292925 0.283098 0.250636 0.236346 0.242769 0.289378 0.346658 0.301483
chargesum: 0.00000
title: Mulliken charges with hydrogens summed into heavy atoms:
elementType: O O O N N N N C C C C C C C C C C C
charge: -0.209619 -0.218045 -0.252149 0.028207 0.025278 -0.128975 -0.000473 -0.047848 -0.077424 0.478252 0.191984 -0.080823 -0.107113 -0.097446 -0.092742 0.372318 -0.085100 0.301719
polarizability: 1.88082231e+02 4.90712190e+00 2.01597117e+02 -7.37689069e+00 1.10373657e+01 1.08559006e+02
1716.lowfreq: -4.4216 -0.0005 -0.0001 0.0005 4.8467 8.1021 17.5984 21.1949 36.3344
frequency: 17.4558 21.1487 36.2630 48.8891 70.2865 92.2571 104.6573 111.9109 126.3059 163.3726 208.7255 239.0803 272.5316 276.8887 290.1742 311.9618 361.6345 367.7280 410.2676 439.8037 461.9366 470.9181 500.9189 504.9848 531.8070 552.3483 582.6571 597.8515 623.1238 629.5108 668.7632 710.8849 715.3812 733.3343 780.9878 801.7190 841.2017 862.4352 913.5989 928.9166 940.3146 987.2012 997.9389 1001.8484 1010.5983 1020.9013 1034.0135 1048.2805 1094.6930 1110.3877 1127.1538 1182.8895 1192.0507 1204.1113 1223.4346 1226.6336 1271.7328 1295.3576 1309.8419 1331.5283 1348.8890 1365.3903 1385.6932 1400.8245 1420.1671 1449.1521 1451.3739 1466.3184 1476.6311 1486.6225 1500.0061 1593.9580 1603.0778 1609.4777 1613.0162 1682.5232 2954.1756 2962.2077 2983.7638 3006.8080 3024.6198 3067.5712 3097.5262 3126.5594 3161.6097 3181.2331 3184.6199 3421.4609 3537.9520 3694.1775
redmass: 5.4622 6.9615 6.5849 3.6706 5.8803 5.2753 4.4903 1.8946 1.9883 4.3046 2.6887 4.6220 3.3579 3.2320 1.7062 3.5179 2.7197 4.5086 2.9190 2.5227 1.9643 2.9999 1.8492 1.9173 2.6023 3.1437 2.4668 4.2909 4.9667 5.7656 4.9660 7.7212 3.4670 5.7328 3.0549 6.8344 1.5568 1.3192 1.8159 2.4843 2.0129 1.3694 1.7601 2.1343 1.7336 1.6094 3.3915 2.3126 3.1882 1.8899 1.7029 1.4990 1.5405 2.0646 1.2259 3.7823 2.5806 2.3437 1.3853 1.6526 1.7610 4.9731 1.2382 6.1147 2.8485 1.1481 1.1857 1.1029 1.0495 2.2934 1.5069 7.3547 1.3365 5.7450 5.3452 5.3323 1.0399 1.0604 1.0660 1.0986 1.0975 1.0959 1.0948 1.0904 1.0909 1.0942 1.0959 1.0750 1.0459 1.1036
irintensity: 2.8169 9.4446 1.9708 8.1734 0.1621 2.5290 6.1187 1.5396 3.0055 1.8126 0.3381 1.7062 1.4425 1.4718 14.0419 4.0625 3.4715 18.6349 0.8780 7.4577 162.3802 15.7625 123.1705 23.0775 25.4422 24.6420 38.9195 9.9638 5.5787 9.2370 19.8808 22.8808 13.2421 10.8493 4.1089 11.3393 28.0850 10.6622 12.0074 7.0449 20.9566 2.7685 7.2017 1.0410 5.3464 4.1090 3.1971 23.8496 19.9281 88.7106 20.0312 60.8605 117.4529 13.8328 2.5442 250.8922 32.2340 300.4862 18.7088 2.0349 11.3062 84.9839 36.3300 7.1600 29.5753 7.3320 185.7546 33.3449 17.4246 4.9542 165.6264 0.9765 118.7625 57.1460 6.7020 287.3042 16.4089 18.5783 42.2530 21.8082 20.2873 15.3538 14.7865 13.3916 3.8656 0.9813 2.5775 10.5656 48.8388 41.1410
temp: 298.150 k
press: 1.00000 atm
elementType: 8 8 8 7 7 7 7 6 6 6 6 6 6 6 6 6 6 6 1 1 1 1 1 1 1 1 1 1 1 1 1 1
symmnumber: 1
zpe: 647496.4 jmol-1
zpe.correction: 0.246618 hartree
zpe.thermalcorrener: 0.264662 hartree
zpe.thermalcorrenthalpy: 0.265606 hartree
zpe.thermalcorrgfe: 0.197540 hartree
zpe.sumelectzpe: -870.821285 hartree
zpe.sumelectthermal: -870.803241 hartree
zpe.sumelectthermalent: -870.802297 hartree
zpe.sumelectthermalfe: -870.870363 hartree
dipole: 7.5789 6.2660 4.2991
dipole: 10.7324
quadrupole: -108.9980 -100.2011 -104.4479
quadrupole: -15.4617 19.5146 -6.0472
quadrupole: -4.4490 4.3479 0.1011 -15.4617 19.5146 -6.0472
hfenergy: -871.0679033 hartree
pointgroup: C01 [X(C11H14N4O3)]
dipole: 3.7081233 -1.0735106 -1.7106815 debye
polarizability: 189.6208513|-12.9218836|181.9886639|9.7977199|35.8139633|126.6288381 unknown
InChI: InChI=1S/C11H14N4O3/c1-8(13-14-11(12)16)2-3-9-4-6-10(7-5-9)15(17)18/h4-7,14H,2-3,12H2,1H3
charge 0 multiplicity 1
32 atoms
O  -4.248334 1.385873 0.246808
O  -4.989224 0.026754 -1.427988
O  2.012332 2.516806 2.185769
N  2.504349 0.121456 0.817064
N  -4.099279 0.389677 -0.561935
N  3.064355 1.327477 0.428554
N  3.538314 3.592327 0.785383
C  0.824489 -2.721594 -0.330608
C  2.007539 -2.212485 0.536208
C  -0.433457 -1.855857 -0.372507
C  2.650623 -0.930274 0.037889
C  -0.643991 -0.745747 0.488535
C  -1.457099 -2.202357 -1.299161
C  -1.843988 -0.006692 0.432585
C  -2.659623 -1.478816 -1.37046
C  -2.837551 -0.383025 -0.495589
C  3.395864 -0.93216 -1.288074
C  2.811229 2.480811 1.217349
H  1.170524 -2.892639 -1.370641
H  0.537914 -3.724166 0.049558
H  1.679063 -2.050914 1.577703
H  2.772685 -3.014845 0.559343
H  0.133131 -0.432951 1.191416
H  -1.305722 -3.05645 -1.970655
H  -2.013123 0.851933 1.087693
H  -3.4524 -1.737911 -2.076962
H  3.384179 -1.934176 -1.745407
H  4.459214 -0.642502 -1.160239
H  2.942205 -0.229483 -2.01681
H  3.597834 1.415192 -0.445837
H  3.365417 4.465297 1.27752
H  4.288233 3.555641 0.097996
