program: Gaussian 09
title: 000223834
version: EM64L-G09RevD.01
frameworkgroup: C1[X(C20H14O3)]
method: RPBEPBE
basis: SDD
operation: Freq
keyword: #pfreq=noraman
keyword: PBEPBE/SDD
title: #p freq=noraman PBEPBE/SDD
converged: YES YES NO NO
title: Mulliken charges:
elementType: O O O C C C C C C C C C C C C C C C C C C C C H H H H H H H H H H H H H H
charge: -0.216340 -0.155730 -0.430542 -0.156252 0.289309 0.444246 0.358746 0.086900 0.139771 -0.551533 -0.399885 -0.339571 -0.383857 -0.376631 -0.317321 0.284994 -0.346283 -0.244627 -0.245231 -0.234796 -0.247098 -0.245252 -0.240337 0.246828 0.258867 0.268443 0.240668 0.253591 0.261547 0.259592 0.228956 0.230669 0.229394 0.228458 0.231866 0.231185 0.357256
chargesum: 0.00000
title: Mulliken charges with hydrogens summed into heavy atoms:
elementType: O O O C C C C C C C C C C C C C C C C C C C C
charge: -0.216340 -0.155730 -0.073287 -0.156252 0.289309 0.444246 0.358746 0.086900 0.139771 -0.304706 -0.141018 -0.071128 -0.143189 -0.123041 -0.055774 0.284994 -0.086691 -0.015671 -0.014562 -0.005402 -0.018640 -0.013386 -0.009152
polarizability: 2.40674041e+02 -6.88750399e+00 2.11837812e+02 3.33698957e+00 1.01588233e+01 1.90613040e+02
1716.lowfreq: -11.0336 -8.3564 -0.0008 -0.0006 0.0002 4.8623 21.5899 37.2248 46.2396
frequency: 21.5192 37.1804 46.2199 51.1527 72.9392 79.4228 130.9302 178.8684 196.5373 222.1491 235.3813 257.6563 273.1771 296.6984 326.2447 331.0459 376.4612 399.2105 402.7483 404.6168 427.6867 443.9469 485.1554 505.8205 540.7810 580.1953 609.3976 613.4782 615.5600 620.0554 652.2922 681.9518 696.8002 701.6572 703.6039 726.4600 746.7014 769.3424 787.1295 824.2665 847.7436 852.7955 854.1101 859.0302 876.5583 908.9882 923.3954 933.2521 945.5963 970.8273 977.8060 982.4054 989.6179 990.9742 996.6167 996.6657 1001.1914 1028.5114 1030.7746 1086.1381 1090.9415 1101.9148 1119.0631 1152.1640 1174.2529 1174.5456 1183.3786 1187.3106 1196.1604 1197.3526 1200.8939 1256.9385 1295.5428 1321.7758 1326.8541 1374.6529 1380.6986 1407.0846 1432.0066 1437.7238 1444.2281 1471.5640 1480.6338 1482.2616 1588.3379 1592.4585 1607.6239 1609.6999 1621.2408 1623.7324 1721.6102 3124.1543 3126.4197 3126.9666 3129.5302 3136.3297 3140.3844 3148.9295 3149.7343 3156.9340 3165.8652 3167.9885 3168.3439 3187.1877 3587.6760
redmass: 3.7795 4.4970 4.8788 6.3944 5.1588 5.0598 9.6188 7.2844 5.2421 5.9719 4.6463 5.2079 5.8419 5.9255 5.3765 1.1335 6.4223 2.8063 3.3141 4.2729 5.7071 3.5833 3.7051 3.8099 5.2875 7.4178 6.3643 5.6032 6.4597 5.2646 6.8377 7.3976 5.3488 2.0218 1.8141 3.4601 2.4803 2.0221 4.0157 1.4203 1.4325 1.3613 4.1662 1.4087 5.4888 4.2814 1.6212 1.5972 1.3502 3.4057 1.4071 1.4195 5.0406 5.9192 1.7084 1.5990 2.2995 2.3689 2.1799 1.6974 1.6303 1.8307 1.8881 1.4736 1.0517 1.0522 2.9874 2.3627 1.1776 1.1792 2.9381 2.0281 2.5190 1.3891 1.3272 6.5834 8.5922 5.9267 2.3523 2.2600 3.8229 3.0573 2.1488 2.1743 5.9878 6.2245 5.9577 6.1158 7.9133 7.2311 12.7818 1.0851 1.0907 1.0861 1.0876 1.0882 1.0920 1.0924 1.0963 1.0957 1.1015 1.1012 1.0889 1.0977 1.0662
irintensity: 0.0561 0.0860 0.0715 0.2095 0.1107 0.9651 2.6279 0.1084 2.0128 0.6613 1.2127 0.7300 2.7156 0.7567 2.7645 130.0587 0.7242 0.0583 1.8606 3.7018 5.7935 12.1524 7.4613 4.0839 17.5745 11.8171 12.4351 0.5702 0.7670 0.4763 24.1927 0.3582 6.4496 32.0316 45.8307 17.6357 69.3471 39.9875 7.2801 37.9026 12.4015 12.6063 17.8167 7.8818 143.3236 0.4355 3.4799 29.0556 0.1601 14.2022 1.8781 2.9845 21.4460 1.1007 25.0382 22.7362 57.5584 5.2862 13.5921 1.5185 8.9175 30.0094 165.1231 86.5020 0.1001 0.0751 56.3206 1.0706 4.4522 0.8152 0.8105 12.8626 0.1352 1.2703 0.2280 0.4766 0.0579 33.5711 6.6277 5.6685 109.5692 105.9042 27.0901 24.7554 1.1541 0.5774 7.5333 6.2095 1.4352 28.9582 261.6816 3.5030 4.4346 1.1968 0.2158 5.6197 15.1697 20.3813 27.5843 20.3887 23.4352 18.3261 2.3955 3.3574 39.7409
temp: 298.150 k
press: 1.00000 atm
elementType: 8 8 8 6 6 6 6 6 6 6 6 6 6 6 6 6 6 6 6 6 6 6 6 1 1 1 1 1 1 1 1 1 1 1 1 1 1
symmnumber: 1
zpe: 735084.5 jmol-1
zpe.correction: 0.279979 hartree
zpe.thermalcorrener: 0.298326 hartree
zpe.thermalcorrenthalpy: 0.299270 hartree
zpe.thermalcorrgfe: 0.232238 hartree
zpe.sumelectzpe: -994.628168 hartree
zpe.sumelectthermal: -994.609821 hartree
zpe.sumelectthermalent: -994.608877 hartree
zpe.sumelectthermalfe: -994.675910 hartree
dipole: 0.0965 0.6219 -4.6181
dipole: 4.6607
quadrupole: -130.3306 -120.9788 -133.7828
quadrupole: 0.1304 7.6193 2.3948
quadrupole: -1.9665 7.3853 -5.4187 0.1304 7.6193 2.3948
hfenergy: -994.9081472 hartree
pointgroup: C01 [X(C20H14O3)]
dipole: -0.0990324 -0.0772064 1.8293704 debye
polarizability: 242.1394805|1.533173|212.2108902|0.9543475|8.6255567|188.774523 unknown
InChI: InChI=1S/C20H14O3/c21-16-11-12-18-17(13-16)20(19(22)23-18,14-7-3-1-4-8-14)15-9-5-2-6-10-15/h1-13,21H
charge 0 multiplicity 1
37 atoms
O  1.245395 0.086345 -2.382819
O  -1.028901 -0.060917 -2.861811
O  3.935192 -0.208107 2.518637
C  -0.255877 0.010654 -0.443082
C  1.214646 -0.015319 -0.030962
C  -0.988421 -1.243629 0.083147
C  -0.986354 1.332135 -0.087859
C  -0.139253 -0.005312 -2.009443
C  2.019545 0.043325 -1.18312
C  1.817043 -0.105869 1.235102
C  -1.620142 -1.209753 1.351975
C  -2.366019 1.455353 -0.398999
C  -0.951634 -2.466755 -0.631432
C  -0.310177 2.43387 0.488944
C  3.419623 0.034479 -1.142867
C  3.234535 -0.12003 1.301327
C  4.028643 -0.044779 0.129455
C  -2.203591 -2.375267 1.895005
C  -3.056336 2.653377 -0.123902
C  -1.537664 -3.631698 -0.089729
C  -1.004594 3.634319 0.766364
C  -2.163805 -3.592243 1.176727
C  -2.378992 3.748553 0.463434
H  1.204739 -0.175932 2.142589
H  -1.672441 -0.266219 1.906791
H  -2.890497 0.615698 -0.867027
H  -0.47434 -2.516853 -1.616647
H  0.757141 2.362181 0.72067
H  4.015297 0.080383 -2.058027
H  5.116871 -0.059342 0.23411
H  -2.693042 -2.331399 2.874434
H  -4.120212 2.734953 -0.372246
H  -1.507769 -4.568031 -0.657735
H  -0.46829 4.478858 1.213302
H  -2.619784 -4.496098 1.595532
H  -2.915614 4.679966 0.675578
H  3.31238 -0.288893 3.28269
