program: Gaussian 09
title: 000223816
version: EM64L-G09RevD.01
frameworkgroup: C1[X(C10H11N3O2)]
method: RPBEPBE
basis: SDD
operation: Freq
keyword: #p
keyword: freq=noraman
keyword: PBEPBE/SDD
title: #p freq=noraman PBEPBE/SDD
converged: YES YES NO NO
title: Mulliken charges:
elementType: O O N N N C C C C C C C C C C H H H H H H H H H H H
charge: -0.312473 -0.302211 -0.026344 -0.006805 -0.658510 -0.075787 0.264393 0.022630 0.134741 0.337479 -0.577032 -0.302712 -0.293223 -0.527807 -0.529599 0.279368 0.339965 0.327925 0.240363 0.239062 0.226515 0.229339 0.259241 0.227068 0.230941 0.253472
chargesum: 0.00000
title: Mulliken charges with hydrogens summed into heavy atoms:
elementType: O O N N N C C C C C C C C C C
charge: -0.312473 -0.302211 -0.026344 -0.006805 0.009380 -0.075787 0.264393 0.022630 0.134741 0.337479 -0.297664 -0.062349 -0.054161 0.187288 0.181882
polarizability: 2.23658100e+02 1.31908124e+00 1.45850110e+02 -4.20936782e-01 -6.27743931e+00 6.96907068e+01
1716.lowfreq: -8.1794 -0.0008 -0.0008 -0.0006 10.0892 14.2616 69.3723 88.0475 110.9005
frequency: 69.3470 88.0458 110.8894 121.2495 149.7104 162.1002 165.7303 203.1429 235.9921 265.7083 289.8195 304.7975 343.9252 380.9439 421.9596 431.7332 499.0040 515.0352 541.8141 561.8836 604.5795 606.6701 627.6065 636.9501 681.0860 739.2921 796.4072 801.6732 851.8341 870.1319 896.6911 918.3667 941.8064 952.2191 1025.5161 1067.7048 1095.8904 1113.8815 1114.9480 1136.7234 1147.9625 1157.8779 1170.6344 1232.8289 1275.3690 1308.1003 1355.3986 1386.7705 1422.5517 1424.3612 1438.9038 1455.5922 1459.0575 1467.8464 1475.2380 1477.7827 1488.0670 1508.4597 1544.2163 1587.3095 1616.4043 2975.6500 2977.8694 3073.5634 3078.5279 3122.6738 3124.0993 3124.6575 3151.0290 3190.9881 3532.7413 3693.7934
redmass: 3.4931 4.4301 2.7210 4.2142 2.6747 1.0788 1.2624 3.8149 4.7189 3.5132 5.6973 5.5160 4.8449 6.2382 5.6496 7.0022 1.9241 2.3488 6.8296 3.2824 1.7342 2.0917 4.5466 4.4496 6.2417 6.9484 3.9519 2.6688 1.6233 1.6470 7.0101 6.3473 1.4708 5.1504 2.7218 4.5952 4.3214 1.2466 1.2504 2.1508 1.3800 1.4805 1.5552 3.3285 5.8834 2.6116 2.8546 2.1938 1.5727 1.8719 1.3699 1.0782 1.1131 3.4874 4.5092 1.0641 1.0621 6.1209 2.2117 2.2525 6.2163 1.0306 1.0305 1.1040 1.1039 1.1037 1.1029 1.0882 1.0972 1.0928 1.0438 1.1047
irintensity: 3.6322 0.4350 8.7991 2.5795 2.4771 0.1573 1.7332 4.5331 7.4917 6.2614 11.3292 9.5583 2.6322 4.0865 1.1811 10.9414 94.8533 135.8957 1.7836 1.6165 14.1719 26.9624 18.2260 14.3537 7.8905 4.9251 3.0679 1.3710 2.4211 51.1411 28.3589 20.3716 1.0567 71.4482 3.4649 118.2843 13.8626 14.6852 2.8328 86.2677 3.4558 23.7238 14.1325 55.4554 76.8384 49.5917 24.4596 8.9763 29.7395 17.5519 16.8575 14.9402 22.8640 141.9791 53.0855 6.1590 18.7077 21.5675 0.1664 212.9219 233.1273 84.9264 64.9364 25.2653 23.3161 22.2601 24.2836 6.8933 48.8031 0.9845 92.3615 55.7953
temp: 298.150 k
press: 1.00000 atm
elementType: 8 8 7 7 7 6 6 6 6 6 6 6 6 6 6 1 1 1 1 1 1 1 1 1 1 1
symmnumber: 1
zpe: 525095.6 jmol-1
zpe.correction: 0.199998 hartree
zpe.thermalcorrener: 0.213764 hartree
zpe.thermalcorrenthalpy: 0.214708 hartree
zpe.thermalcorrgfe: 0.160169 hartree
zpe.sumelectzpe: -701.241886 hartree
zpe.sumelectthermal: -701.228120 hartree
zpe.sumelectthermalent: -701.227176 hartree
zpe.sumelectthermalfe: -701.281715 hartree
dipole: 1.7881 2.4964 -0.4707
dipole: 3.1066
quadrupole: -71.1677 -85.5891 -88.3484
quadrupole: -0.9290 0.1262 4.1246
quadrupole: 10.5340 -3.8874 -6.6466 -0.9290 0.1262 4.1246
hfenergy: -701.4418843 hartree
pointgroup: C01 [X(C10H11N3O2)]
dipole: -0.7223713 -0.9629526 -0.2115482 debye
dipolederiv: -1.3606631 -0.2327394 0.2373677 -0.27526 -0.4283517 0.1008792 0.1073815 0.0761826 -0.3944001 -1.4712934 0.3948229 -0.2611962 0.3535665 -0.5245555 0.1283357 -0.0839493 0.0952075 -0.4120328 0.0471328 0.1279946 0.0564922 -0.0763153 -0.3260346 -0.0188044 -0.0161967 -0.0269463 -0.2433435 -0.2008677 0.0224887 -0.0104139 0.0146395 -0.2130328 0.0103597 0.0049441 0.0036101 -0.2648188 -0.1885231 -0.0143514 0.014221 -0.0666627 -1.4652402 -0.1490138 0.0107893 -0.1044268 -0.6595914 0.0299657 -0.3999879 -0.1016998 0.7484255 -0.1678186 -0.0235858 0.1472976 -0.0487728 0.0097261 -0.175967 -0.1392758 0.0228954 0.050864 1.4371328 0.2812529 0.085859 0.2578057 0.171457 0.8804068 0.6685992 -0.0443323 0.4722996 -0.304395 -0.147068 0.0922012 -0.0615857 -0.1444734 0.4772609 0.0624145 0.0330493 -0.8678506 -0.0469831 -0.0465868 -0.1415041 -0.0183279 0.1367496 1.2265416 -0.2700284 0.1566203 -0.3787851 0.7928049 -0.0487006 -0.0802729 0.0820907 0.0171844 -0.7680152 -0.0887414 -0.0674784 0.0275997 -0.143848 0.0566548 -0.1048399 0.0407299 -0.2310944 -0.0382499 -0.1526954 -0.0377256 -0.4073317 0.0346929 -0.0019086 -0.0814268 0.0112884 -0.0320553 0.1445083 0.051987 0.0171711 0.3787282 0.1872533 0.0480476 0.0790416 0.0360647 -0.0047413 0.595074 0.110324 -0.1675619 -0.0605891 0.2085168 -0.0529159 -0.3660659 -0.1591222 0.4518304 0.6379818 -0.1684481 0.1769694 0.0511617 0.2145356 -0.0620074 0.3826548 -0.2280949 0.4636761 0.0820988 -0.010758 0.0028156 0.0310173 0.0010093 -0.0231579 -0.0044984 -0.0230368 0.1754058 0.2017375 -0.0215525 -0.0071261 0.0012639 0.2973836 -0.011027 0.0011838 -0.0175444 0.351702 0.1803807 0.0541282 -0.0078961 0.0025458 0.2668244 -0.0063011 -0.0112129 -0.0270083 0.3605591 -0.0990555 0.0693241 0.0086693 0.1061348 0.0416384 -0.0146338 0.0139611 -0.0129809 0.1336535 -0.119895 -0.0702947 -0.0186664 -0.0982922 0.0598989 -0.0141763 -0.0210178 -0.0132081 0.1255824 0.0040691 0.0702523 -0.0959813 0.0344266 0.0350185 0.0871175 0.067463 0.1051467 -0.1066792 -0.114362 -0.1136212 0.0033216 -0.1469421 0.0348153 -0.0084211 -0.0188914 -0.0336731 0.0618059 0.0725255 0.0266806 0.0252822 0.1249547 -0.0339129 -0.0814102 0.0488362 -0.0151043 0.0440447 0.0057733 -0.0742798 0.0921007 -0.0312551 0.0323036 0.096033 -0.0823215 0.1322202 -0.1073302 -0.1134434 0.126645 0.0023325 0.1341552 0.0416319 -0.0094154 0.027958 -0.0289263 0.0625445 0.0648784 -0.0288868 -0.0292303 -0.1224992 -0.0312877 -0.0895464 -0.0573738 -0.0215876 0.0346388 unknown
polarizability: 223.6407864|-0.4992763|145.5802062|2.468794|7.6238277|69.9779236 unknown
InChI: InChI=1S/C10H11N3O2/c1-14-7-5-6-9(13-4-3-12-6)8(11)10(7)15-2/h3-5H,11H2,1-2H3
charge 0 multiplicity 1
26 atoms
O  -2.454253 -1.166873 -0.227852
O  -2.411227 1.710044 0.22177
N  2.377619 -1.213051 -0.201309
N  2.438804 1.615616 0.326678
N  -0.044699 -2.534114 -0.46747
C  1.212452 -0.479196 -0.092763
C  -0.044486 -1.178069 -0.232655
C  -1.241933 -0.440658 -0.100228
C  1.225034 0.947463 0.178099
C  -1.208108 0.978523 0.10851
C  0.001239 1.666068 0.267747
C  3.536071 -0.53761 -0.048986
C  3.55856 0.872694 0.211049
C  -3.288342 -1.182156 1.001995
C  -3.256189 1.716402 -0.997036
H  0.008436 2.743641 0.442421
H  0.856256 -3.003201 -0.546849
H  -0.925478 -3.019929 -0.611144
H  4.466591 -1.108921 -0.132506
H  4.513745 1.39779 0.326685
H  -2.733704 -1.657244 1.832654
H  -4.176477 -1.780381 0.7469
H  -3.57857 -0.155211 1.284747
H  -2.722947 2.228525 -1.819834
H  -4.156782 2.286068 -0.722522
H  -3.522311 0.688678 -1.302302
