program: Gaussian 09
title: 000223813
version: EM64L-G09RevD.01
frameworkgroup: C1[X(C10H8O2)]
method: RPBEPBE
basis: SDD
operation: Freq
keyword: #pfreq=noraman
keyword: PBEPBE/SDD
title: #p freq=noraman PBEPBE/SDD
converged: NO YES NO YES
title: Mulliken charges:
elementType: O O C C C C C C C C C C H H H H H H H H
charge: -0.187544 -0.187544 0.163080 0.163080 -0.516416 -0.516416 -0.205825 -0.205826 0.036348 0.036348 -0.276111 -0.276111 0.250054 0.250006 0.250037 0.250023 0.220613 0.220613 0.265794 0.265794
chargesum: 0.00000
title: Mulliken charges with hydrogens summed into heavy atoms:
elementType: O O C C C C C C C C C C
charge: -0.187544 -0.187544 0.163080 0.163080 -0.016355 -0.016356 0.014788 0.014788 0.036348 0.036348 -0.010317 -0.010317
polarizability: 1.09352449e+02 8.70163934e-06 1.55068221e+02 2.50150901e-04 2.30150782e-03 5.06733631e+01
1716.lowfreq: -12.4238 -9.9616 0.0004 0.0005 0.0008 10.4643 62.7641 89.0163 100.8127
frequency: 62.7316 89.0143 100.7907 238.3077 244.5522 263.7627 345.8076 381.5056 430.3412 448.7939 466.6202 497.2314 565.2604 584.2262 646.4977 676.6572 713.1300 747.2837 781.8208 838.9291 909.0696 941.2448 945.5509 981.6669 989.1457 994.0623 998.3912 1021.8722 1124.4916 1140.1654 1176.4443 1183.8924 1190.3390 1254.4823 1298.7259 1346.8093 1351.3604 1379.1680 1393.3709 1435.0690 1443.4725 1522.3562 1548.4644 1606.1722 1646.7077 1698.0293 2963.2262 2964.1222 2990.5588 2990.6639 3110.7884 3141.5649 3143.3933 3169.7315
redmass: 2.2604 7.9846 3.4754 3.0711 6.3384 4.4759 9.5949 2.0329 6.5657 11.8017 3.8465 7.3677 4.5712 2.0949 5.3425 1.1967 6.5845 6.0080 5.5465 1.7256 4.1359 1.9856 1.7110 2.6040 1.4308 1.3107 2.7010 3.9406 1.3519 2.5801 1.0885 1.0447 1.1086 2.4419 3.2446 1.7710 2.0009 1.5464 3.3661 1.1243 1.0666 12.0057 9.6056 7.4429 7.4406 6.7196 1.0611 1.0614 1.0958 1.0954 1.0844 1.0996 1.0868 1.1012
irintensity: 1.3210 13.5847 0.0000 3.1756 0.2885 0.0000 16.2849 0.0000 0.3311 1.3949 0.0000 8.5276 0.0473 1.6397 1.5425 72.9046 3.0347 0.2090 0.0000 35.8414 8.8136 15.5167 0.0000 16.8169 0.0001 0.0000 16.4376 9.2033 23.3171 5.9038 0.7951 0.4126 0.0000 14.7799 95.3054 0.2747 0.0517 1.2981 28.1336 2.5598 34.5493 8.3827 247.1957 50.7539 8.9310 0.3416 0.5596 15.1083 0.0035 18.6526 5.8999 50.8087 0.6631 8.9066
temp: 298.150 k
press: 1.00000 atm
elementType: 8 8 6 6 6 6 6 6 6 6 6 6 1 1 1 1 1 1 1 1
symmnumber: 1
zpe: 395472.5 jmol-1
zpe.correction: 0.150628 hartree
zpe.thermalcorrener: 0.160416 hartree
zpe.thermalcorrenthalpy: 0.161360 hartree
zpe.thermalcorrgfe: 0.115015 hartree
zpe.sumelectzpe: -535.430113 hartree
zpe.sumelectthermal: -535.420325 hartree
zpe.sumelectthermalent: -535.419381 hartree
zpe.sumelectthermalfe: -535.465726 hartree
dipole: 0.8037 0.0000 0.0004
dipole: 0.8037
quadrupole: -58.7006 -83.4690 -69.5938
quadrupole: 0.0000 0.0009 -0.0031
quadrupole: 11.8872 -12.8812 0.9940 0.0000 0.0009 -0.0031
hfenergy: -535.5807404 hartree
pointgroup: C01 [X(C10H8O2)]
dipole: -0.3161922 0.0000012 -0.000145 debye
dipolederiv: -0.5120164 0.0189556 -0.0000215 0.0878972 -0.9022467 -0.0003131 -0.0000272 -0.000117 -0.3171914 -0.5120173 -0.0189589 -0.0000194 -0.0879005 -0.9022455 -0.0003456 0.0000182 -0.0000233 -0.3171914 -0.1200605 0.4616633 0.0001617 0.5484884 -0.080414 0.0001156 0.0000901 -0.0000345 -0.0280868 -0.1200696 -0.4616626 -0.0000747 -0.548488 -0.0804063 -0.0000288 -0.0000245 -0.0003322 -0.028087 -0.1147748 -0.0638611 0.0000085 -0.0698734 -0.1445935 -0.0001342 0.0001039 -0.0003495 0.1979299 -0.1147734 0.0638604 0.0000645 0.0698719 -0.1445937 -0.0000383 -0.0000507 0.0003139 0.1979305 0.1878575 -0.0251127 -0.0003027 -0.1187878 0.0625763 0.0001306 -0.0003132 0.0002412 -0.2413204 0.1878582 0.0251122 -0.0002255 0.1187875 0.062575 0.0000498 -0.0002085 -0.0000661 -0.2413208 0.8631038 -0.1447663 0.0000832 -0.0961552 0.9712217 0.000288 0.0001731 0.0003439 0.1978285 0.863106 0.1447672 0.0000823 0.0961568 0.9712191 0.0002681 -0.0001118 0.0002849 0.1978286 -0.1862727 -0.2671924 -0.0001402 -0.2779998 -0.0543389 0.0000328 -0.0002504 -0.0000551 -0.1130155 -0.1862681 0.2671932 0.0001402 0.2780006 -0.0543431 0.0000985 0.000287 -0.0000093 -0.1130154 0.0281449 0.0302653 -0.006085 0.0036616 0.0296411 0.0863115 -0.0031788 0.1081004 -0.0067155 0.0281256 0.0301826 0.0061082 0.003626 0.029838 -0.086259 0.0031721 -0.1080889 -0.007162 0.0281169 -0.030177 0.0060798 -0.0036259 0.0297455 0.0862716 0.0032109 0.1080732 -0.0069704 0.0281528 -0.030271 -0.0061147 -0.0036613 0.0297334 -0.0862993 -0.003142 -0.1081164 -0.0069076 -0.1364828 -0.0806162 0.0001235 -0.0878983 0.0323573 0.0000039 0.0001214 0.0000338 0.1622637 -0.1364809 0.0806173 0.0001635 0.0878995 0.0323561 -0.0000912 0.0001837 -0.0001161 0.1622637 -0.0376243 0.0355389 0.0000139 0.0741505 0.0559586 -0.0000211 -0.0000084 -0.000036 0.1554697 -0.0376248 -0.0355378 -0.0000453 -0.0741497 0.0559596 -0.0000398 -0.0000448 -0.0000472 0.1554698 unknown
polarizability: 109.3524491|0.0001984|155.068214|-0.001686|0.0263521|50.6733697 unknown
InChI: InChI=1S/C10H8O2/c11-9-5-6-10(12)8-4-2-1-3-7(8)9/h1-2,5-6H,3-4H2
charge 0 multiplicity 1
20 atoms
O  1.071171 -2.720716 -0.000723
O  1.071194 2.720724 0.00033
C  -0.23251 -0.688571 -0.000479
C  -0.232504 0.68859 -0.00002
C  -1.500758 -1.516508 -0.000912
C  -1.500746 1.516538 0.000065
C  -2.760373 -0.678324 0.000173
C  -2.760368 0.678364 0.000574
C  1.059218 -1.446128 -0.000901
C  1.05923 1.446136 0.000708
C  2.337079 -0.682225 -0.000157
C  2.337085 0.682222 0.000192
H  -1.483993 -2.203981 0.87052
H  -1.484474 -2.202227 -0.873767
H  -1.484441 2.202912 -0.872265
H  -1.48399 2.203357 0.872023
H  -3.713468 -1.222509 0.000605
H  -3.713458 1.222557 0.001323
H  3.256698 -1.277826 -0.000171
H  3.256708 1.277816 0.000383
