program: Gaussian 09
title: 000223812
version: EM64L-G09RevD.01
frameworkgroup: C1[X(C10H8N6O)]
method: RPBEPBE
basis: SDD
operation: Freq
keyword: #p
keyword: freq=noraman
keyword: PBEPBE/SDD
title: #p freq=noraman PBEPBE/SDD
converged: YES YES NO NO
title: Mulliken charges:
elementType: O N N N N N N C C C C C C C C C C H H H H H H H H
charge: -0.225495 -0.164765 -0.357384 0.027050 -0.104526 -0.060977 -0.576931 0.165455 -0.140463 0.492713 -0.367014 -0.378037 0.037772 0.035437 -0.186246 -0.195391 -0.246172 0.346648 0.294706 0.213563 0.240563 0.236429 0.241084 0.330593 0.341391
chargesum: 0.00000
title: Mulliken charges with hydrogens summed into heavy atoms:
elementType: O N N N N N N C C C C C C C C C C
charge: -0.225495 -0.164765 -0.010737 0.027050 -0.104526 -0.060977 0.095053 0.165455 -0.140463 0.492713 -0.072308 -0.164474 0.037772 0.035437 0.054316 0.041038 -0.005088
polarizability: 3.35181854e+02 6.27828021e+00 1.63854042e+02 2.90226198e-01 -1.88105804e+00 5.96243478e+01
1716.lowfreq: -6.4722 -5.0359 -0.0006 0.0002 0.0003 2.4606 21.9619 47.0921 96.1597
frequency: 21.8419 47.0819 96.1544 107.3301 170.8940 199.4211 229.9558 256.2305 280.7050 293.5900 339.5512 397.1745 426.1791 444.8186 489.4063 497.5323 500.6679 530.2952 547.0502 573.7881 611.0380 615.3142 643.8091 660.9546 687.1358 695.6493 717.2727 757.6693 785.9841 803.2365 826.6247 900.5891 910.2375 960.4444 974.2803 984.3203 996.4570 1000.7042 1015.2577 1038.8434 1082.4465 1141.0516 1167.4539 1177.2997 1194.2084 1211.0709 1273.2025 1324.9848 1332.9442 1364.5698 1382.0722 1390.3992 1435.5389 1452.3795 1487.8356 1497.7504 1564.9606 1594.6217 1602.5928 1608.1066 1629.3206 3134.7135 3146.1344 3157.3373 3173.8011 3187.7227 3549.2988 3608.7612 3711.8740
redmass: 4.1100 5.9845 5.8116 7.4776 6.5724 7.1428 4.3724 7.6057 5.3689 6.0234 4.0512 2.5411 1.5708 5.6061 4.6306 1.3180 3.9477 7.3756 6.8761 1.0903 6.4443 7.0737 5.4373 9.8826 2.0262 6.1176 11.2204 1.6597 11.8644 10.6134 1.2642 9.7108 1.3923 8.4315 1.3791 5.7756 2.5726 1.3265 3.5029 1.9675 1.9804 3.9868 3.5828 1.0734 1.1329 4.9144 2.2230 2.7859 1.8897 5.0071 4.9104 6.7219 4.4746 2.4507 2.9604 3.4791 4.2810 6.1738 2.8187 3.9356 5.6076 1.0869 1.0883 1.0937 1.0983 1.0977 1.0440 1.0828 1.1061
irintensity: 4.5297 0.0938 2.8857 1.2380 2.8430 1.2268 8.8595 1.4588 2.5304 5.9188 2.8207 12.7167 90.0234 3.0470 9.7384 248.4939 25.2927 3.7288 4.8130 38.3947 0.4419 6.0873 2.0023 1.8312 46.0477 20.0028 11.4374 95.4940 9.9472 2.6048 1.0685 90.9495 6.9456 5.0100 0.5275 0.2692 142.6100 1.2869 1.0541 13.8245 26.4048 39.8830 5.7320 1.4519 0.6531 30.7334 81.1014 27.3646 45.1005 470.0172 175.9509 158.5560 62.5622 2.6246 208.9011 254.6594 200.8928 137.7491 802.3618 84.7056 172.0125 12.8318 0.8949 21.4711 16.1954 3.9053 204.7887 82.5648 50.5249
temp: 298.150 k
press: 1.00000 atm
elementType: 8 7 7 7 7 7 7 6 6 6 6 6 6 6 6 6 6 1 1 1 1 1 1 1 1
symmnumber: 1
zpe: 470251.7 jmol-1
zpe.correction: 0.179109 hartree
zpe.thermalcorrener: 0.192482 hartree
zpe.thermalcorrenthalpy: 0.193426 hartree
zpe.thermalcorrgfe: 0.137956 hartree
zpe.sumelectzpe: -788.370985 hartree
zpe.sumelectthermal: -788.357612 hartree
zpe.sumelectthermalent: -788.356668 hartree
zpe.sumelectthermalfe: -788.412138 hartree
dipole: 6.2352 -7.5253 -0.5484
dipole: 9.7882
quadrupole: -77.8899 -101.6713 -101.0962
quadrupole: 18.4860 0.8178 -1.6080
quadrupole: 15.6625 -8.1188 -7.5437 18.4860 0.8178 -1.6080
hfenergy: -788.5500942 hartree
pointgroup: C01 [X(C10H8N6O1)]
dipole: 2.4458741 -2.9732719 -0.085729 debye
dipolederiv: -0.5299118 -0.0040704 -0.0017349 0.1756552 -1.2005941 -0.0134005 0.0022962 -0.0116055 -0.3681257 -1.7250617 0.1990805 -0.0110097 0.7497522 0.2664933 0.0292599 0.0518478 0.0038474 0.0549048 -0.3784917 -0.0682696 -0.0258476 0.7311679 -0.3586286 0.0287075 -0.1248381 0.0259515 -0.2822283 1.2142595 -0.0949574 0.0069993 -0.7881027 -0.0962853 -0.0063155 0.085555 -0.0045876 -0.1029366 -2.1181748 0.1028837 -0.0219787 -0.1711857 -0.552449 -0.007716 -0.02829 -0.0072977 -0.2676397 -0.8359591 -0.4539105 -0.0133473 -0.2996631 -1.4368327 -0.0217518 -0.0052 -0.0198923 -0.303258 -1.5921792 -0.6525027 -0.0205771 -0.6916684 -0.6093686 -0.0086353 -0.0269078 -0.0102744 -0.6886606 1.4196246 0.2007262 0.0257259 1.3317558 0.2123404 0.0084431 0.0365822 0.0012594 0.2000529 -1.271627 0.1703943 -0.006191 -0.8767718 -0.1524043 -0.0166145 -0.0439964 0.0001568 0.0857511 1.6496887 -0.0554977 0.0270095 -0.0364238 0.0350749 -0.0220695 -0.0190025 -0.0012737 0.0666314 -0.3653445 -0.0329228 -0.0008691 -0.2025856 -0.0314809 -0.0217979 0.0004166 -0.0079821 -0.1342026 -0.2315326 0.0147077 -0.0153029 0.2115716 -0.0272623 -0.0339523 -0.0217664 -0.0474568 -0.1788049 1.3679635 0.2999613 0.0168806 -0.1272305 1.5913326 0.0216991 -0.0037311 0.0212785 0.1888433 2.4181681 0.2909722 0.0328869 -0.0091925 1.567774 0.0225895 0.0439255 0.0249874 0.1862993 0.1616036 0.0670682 -0.0074479 0.1002519 0.1345406 -0.0452241 -0.0139829 -0.0412124 -0.1201738 -0.0019808 -0.0240243 0.0037293 -0.2089047 0.1166336 -0.0442546 0.0405131 -0.0458133 -0.1216594 -0.0660377 -0.0036144 -0.0003858 0.1038629 -0.1271514 -0.0014029 -0.0187427 -0.0034006 -0.1605124 0.2311236 0.0214092 0.0060435 -0.0535626 0.2417618 -0.0051457 0.0464609 -0.0046884 0.3698704 0.1112532 0.0585956 -0.0116047 0.0610385 0.0615896 0.0223362 -0.0271313 0.0163795 0.169918 0.0390557 -0.1163185 0.0206286 -0.1150658 -0.0258261 0.037507 0.0273574 0.0381354 0.1621642 0.0220132 -0.0677191 0.0112149 -0.0992456 -0.0360895 0.0324392 0.0191316 0.0309328 0.1508002 0.0198072 0.0691624 -0.0122588 0.1050568 -0.0443373 0.0367617 -0.0189601 0.0354891 0.152929 -0.1140556 0.0004167 -0.0004372 0.0014623 0.0973495 0.0126235 0.0001819 0.0104071 0.1676358 0.2253759 0.0293237 -0.0021556 0.1547445 0.2271572 -0.0001111 0.0003249 -0.0009924 0.3825172 0.35042 0.0491056 0.0000297 -0.0467168 0.1466624 -0.003975 -0.0020436 -0.0023475 0.3898843 unknown
polarizability: 335.1885473|5.8649202|163.5515473|2.7112766|-5.5575303|59.9201493 unknown
InChI: InChI=1S/C10H8N6O/c11-10-12-8-7(9(17)13-10)14-16(15-8)6-4-2-1-3-5-6/h1-5,15H,11H2
charge 0 multiplicity 1
25 atoms
O  -2.583475 2.715928 0.052889
N  0.750824 -0.079846 0.048807
N  -0.071152 -1.226353 0.037496
N  -0.003695 1.061095 0.057164
N  -2.497132 -1.533649 -0.002024
N  -3.721012 0.649321 0.012844
N  -4.825468 -1.400735 -0.03305
C  -1.390931 -0.795542 0.025708
C  -1.298233 0.65595 0.044777
C  2.172544 -0.10254 0.067643
C  2.864514 1.118886 -0.133648
C  2.878228 -1.312755 0.282917
C  -2.563212 1.450246 0.037921
C  -3.646877 -0.698876 -0.006143
C  4.271934 1.115168 -0.125646
C  4.289634 -1.295167 0.278884
C  4.992939 -0.087151 0.074241
H  0.304251 -2.16726 -0.0638
H  2.293642 2.037753 -0.288125
H  2.36082 -2.257936 0.481029
H  4.808155 2.057001 -0.280632
H  4.836489 -2.228792 0.446416
H  6.087383 -0.080802 0.074643
H  -4.80426 -2.417188 -0.046614
H  -5.699111 -0.879756 -0.036996
