program: Gaussian 09
title: 000223835
version: EM64L-G09RevD.01
frameworkgroup: C1[X(C20H14O8)]
method: RPBEPBE
basis: SDD
operation: Freq
keyword: #pfreq=noraman
keyword: PBEPBE/SDD
title: #p freq=noraman PBEPBE/SDD
converged: YES YES NO NO
title: Mulliken charges:
elementType: O O O O O O O O C C C C C C C C C C C C C C C C C C C C H H H H H H H H H H H H H H
charge: -0.241828 -0.414456 -0.435828 -0.439855 -0.408905 -0.218611 -0.431662 -0.424740 0.081361 0.382643 0.238535 -0.151783 0.079639 0.084078 -0.388265 0.152228 0.284432 0.252288 0.436035 -0.392066 -0.231980 -0.228864 -0.549815 -0.605656 -0.617197 -0.638882 0.357840 0.369287 0.255096 0.265089 0.227670 0.229235 0.273304 0.248349 0.208640 0.221842 0.363050 0.369430 0.360326 0.364378 0.352212 0.363407
chargesum: 0.00000
title: Mulliken charges with hydrogens summed into heavy atoms:
elementType: O O O O O O O O C C C C C C C C C C C C C C C C C C C C
charge: -0.241828 -0.051405 -0.066398 -0.079529 -0.044526 -0.218611 -0.079450 -0.061334 0.081361 0.382643 0.238535 -0.151783 0.079639 0.084078 -0.133169 0.152228 0.284432 0.252288 0.436035 -0.126976 -0.004310 0.000370 -0.276512 -0.357307 -0.408557 -0.417041 0.357840 0.369287
polarizability: 2.72368529e+02 -5.27863042e+00 2.69798018e+02 -7.22230748e+00 -2.67100702e+00 2.05491866e+02
1716.lowfreq: -5.8344 -0.0009 -0.0007 -0.0005 2.3948 6.0163 21.9183 39.1517 45.2899
frequency: 21.8289 39.1461 45.2734 48.9739 61.1602 72.2539 124.2516 137.9851 145.1561 187.5095 200.6395 207.5474 209.1797 217.2775 223.4202 242.2040 250.5004 270.4328 274.0297 291.2739 319.1191 321.4661 325.5983 329.3048 348.4798 350.6485 363.6024 370.2318 391.4161 417.8705 434.3096 485.1278 510.0845 513.8045 514.5616 543.6240 546.6533 561.6979 569.5422 574.7414 577.5607 580.8347 585.5119 599.3769 604.3397 611.3721 624.5510 645.6119 663.4440 693.3363 719.1909 726.7687 754.8402 760.6139 772.7990 781.2861 785.3128 816.0941 840.9009 853.0233 874.0006 898.5394 915.5341 963.2300 982.5420 987.7639 993.7137 995.8149 1003.9477 1006.2440 1030.4855 1082.9221 1106.6897 1111.1784 1143.4672 1146.4828 1159.5033 1171.2707 1175.6135 1180.7093 1188.0332 1195.7846 1199.2458 1220.2915 1234.8949 1256.1959 1278.7973 1284.4579 1338.2769 1358.5992 1393.7981 1400.6783 1402.5420 1443.6354 1446.2923 1450.9824 1459.5352 1512.4743 1516.6565 1600.5506 1605.1177 1608.1458 1618.3630 1628.7289 1644.8191 1694.1229 3105.8992 3117.6581 3128.9118 3142.8167 3154.6244 3155.3051 3166.8099 3196.0361 3298.3613 3572.0564 3577.0417 3583.1735 3585.7310 3586.3671
redmass: 6.7181 7.2807 7.4916 6.5393 6.9674 6.8441 8.0203 6.6482 5.2088 7.3442 7.7085 7.0254 7.4242 4.9941 4.8087 7.3619 5.1837 6.7828 1.2694 3.9713 3.4346 1.3685 3.1185 1.3468 1.6224 2.6430 2.4520 1.3554 5.9726 3.4417 5.7251 5.6865 7.5856 6.8192 6.7442 6.2649 4.6290 6.1761 7.9466 5.9791 4.2524 3.0016 2.9317 4.4628 2.6937 2.7515 1.5897 4.5501 4.8981 6.0089 3.3103 3.9409 2.1077 2.6233 2.4971 2.8674 2.0026 2.2077 1.6354 8.9038 2.2193 2.4365 7.3138 1.4138 4.8484 6.4781 4.7785 1.3348 5.0842 4.6068 2.6034 3.2066 2.0365 1.9560 1.6382 1.2656 1.5969 1.1393 1.4873 1.4205 1.4372 1.6458 2.2368 2.1129 2.9577 1.9862 1.4948 1.5904 7.3124 7.0414 4.3107 6.7511 7.1317 3.5860 3.9383 2.5596 2.5227 3.2012 3.0858 6.6389 7.4673 7.2485 7.2494 6.3440 6.8832 12.9497 1.0914 1.0919 1.0857 1.0898 1.0956 1.0925 1.1003 1.0929 1.0657 1.0660 1.0663 1.0662 1.0661 1.0663
irintensity: 2.2535 0.2203 0.8332 2.8244 0.9532 3.7910 1.0499 3.6237 1.6691 0.5049 1.1558 0.2683 0.1321 2.2443 2.4987 1.7299 4.5129 12.3607 58.4372 34.2130 17.8288 114.6466 39.0792 69.0732 3.1808 1.5372 7.2294 208.7822 1.5239 2.8785 1.2421 9.9939 3.6491 3.7843 3.5336 15.3736 34.3622 8.7920 0.8961 17.8292 23.5892 0.4567 21.7711 11.3849 44.7198 25.9992 11.0762 5.8169 21.3111 5.7065 8.4271 25.1389 42.4162 23.5778 21.6764 15.8020 21.7208 46.2908 33.7330 112.9732 7.8982 8.3089 6.3408 1.1415 109.9456 175.5272 50.5912 0.0794 113.5742 124.1214 47.4023 81.9408 86.1357 284.8328 2.6034 101.7382 88.8698 10.5159 65.3119 16.0224 2.0172 14.5276 109.1527 59.3269 57.3097 171.5942 5.1051 27.3850 6.0438 18.2721 58.9892 13.6121 16.1509 77.3684 119.8088 23.2774 3.7891 9.7944 7.5757 178.7290 113.7706 177.1012 13.8406 320.6118 224.1064 399.5025 13.8206 9.6475 1.8706 10.0043 11.9665 1.6345 26.4204 0.1745 516.3796 58.4171 42.9620 31.2665 47.0134 56.8402
temp: 298.150 k
press: 1.00000 atm
elementType: 8 8 8 8 8 8 8 8 6 6 6 6 6 6 6 6 6 6 6 6 6 6 6 6 6 6 6 6 1 1 1 1 1 1 1 1 1 1 1 1 1 1
symmnumber: 1
zpe: 779607.3 jmol-1
zpe.correction: 0.296937 hartree
zpe.thermalcorrener: 0.321324 hartree
zpe.thermalcorrenthalpy: 0.322268 hartree
zpe.thermalcorrgfe: 0.244000 hartree
zpe.sumelectzpe: -1370.324583 hartree
zpe.sumelectthermal: -1370.300196 hartree
zpe.sumelectthermalent: -1370.299252 hartree
zpe.sumelectthermalfe: -1370.377520 hartree
dipole: 1.1356 -1.9658 -1.0550
dipole: 2.5034
quadrupole: -123.0318 -149.6632 -166.1639
quadrupole: -12.5595 -8.2640 -30.4044
quadrupole: 23.2545 -3.3769 -19.8776 -12.5595 -8.2640 -30.4044
hfenergy: -1370.6215202 hartree
pointgroup: C01 [X(C20H14O8)]
dipole: -0.3084659 0.8319567 -0.4274837 debye
polarizability: 270.7925451|-5.1849304|271.8619657|5.413865|-0.3842742|205.0039027 unknown
InChI: InChI=1S/C20H14O8/c21-9-5-13(23)17(14(24)6-9)20(18-15(25)7-10(22)8-16(18)26)12-4-2-1-3-11(12)19(27)28-20/h1-8,21-26H
charge 0 multiplicity 1
42 atoms
O  -0.234263 -0.585855 1.713777
O  0.309389 1.929847 -1.839632
O  -2.468938 -1.054636 -1.311526
O  2.402714 -0.879297 1.578915
O  -0.384774 2.323557 1.436905
O  -0.375421 -2.551309 2.960998
O  4.917722 2.574317 -0.833744
O  -5.064577 2.755262 0.056092
C  -0.074089 -0.196743 0.245623
C  0.041782 -1.561703 -0.453191
C  1.251447 0.555642 0.005844
C  -1.348202 0.644701 0.006076
C  -0.036246 -2.587966 0.505183
C  -0.229014 -2.001512 1.854009
C  0.326192 -1.85747 -1.798467
C  1.375719 1.555907 -1.0087
C  -2.533782 0.165595 -0.634543
C  2.450674 0.19585 0.677987
C  -1.501448 1.865539 0.745695
C  0.110321 -3.94534 0.155228
C  0.473852 -3.214809 -2.163463
C  0.35884 -4.253891 -1.199361
C  2.590938 2.216906 -1.27818
C  -3.749291 0.884606 -0.62605
C  3.679535 0.853822 0.437073
C  -2.707761 2.598611 0.774045
C  3.734575 1.873072 -0.539714
C  -3.831143 2.096473 0.081904
H  0.42122 -1.064058 -2.546776
H  0.046379 -4.721663 0.924678
H  0.686576 -3.472313 -3.207314
H  0.481331 -5.296925 -1.511485
H  2.632225 2.983721 -2.053605
H  -4.636461 0.514156 -1.15001
H  4.580436 0.555659 0.991064
H  -2.766678 3.541123 1.334062
H  -0.548563 1.556193 -1.479726
H  -3.351535 -1.29551 -1.689147
H  3.279599 -1.013265 2.01553
H  -0.584509 3.146442 1.948194
H  5.663217 2.260114 -0.264864
H  -5.039284 3.592649 0.581919
