program: Gaussian 09
title: 000223797
version: EM64L-G09RevD.01
frameworkgroup: C1[X(C10H22O4)]
method: RPBEPBE
basis: SDD
operation: Freq
keyword: #pfreq=noraman
keyword: PBEPBE/SDD
title: #p freq=noraman PBEPBE/SDD
converged: YES YES NO NO
title: Mulliken charges:
elementType: O O O O C C C C C C C C C C H H H H H H H H H H H H H H H H H H H H H H
charge: -0.274973 -0.279188 -0.280430 -0.247765 -0.502244 -0.003890 0.049559 -0.210395 -0.227712 -0.246442 -0.681562 -0.682393 -0.511695 -0.677408 0.258836 0.239722 0.230534 0.191531 0.211173 0.193778 0.223760 0.190644 0.225415 0.188456 0.204099 0.229245 0.224362 0.204950 0.221837 0.223514 0.190503 0.234009 0.233301 0.203475 0.226064 0.227329
chargesum: 0.00000
title: Mulliken charges with hydrogens summed into heavy atoms:
elementType: O O O O C C C C C C C C C C
charge: -0.274973 -0.279188 -0.280430 -0.247765 -0.003686 0.226645 0.241090 0.194556 0.186692 0.167429 -0.023856 -0.032092 0.146118 -0.020540
polarizability: 1.41598620e+02 -3.42387236e+00 1.19570203e+02 3.49684408e-01 -1.85348939e+00 1.17286877e+02
1716.lowfreq: -13.9393 -5.9373 -0.0005 0.0007 0.0007 9.5534 21.7234 28.0237 45.4993
frequency: 18.1149 26.7734 45.2269 48.0403 59.2812 71.7161 91.9260 104.0828 123.8328 159.6751 177.0086 193.1179 207.9252 222.1463 233.9581 239.6670 251.9482 255.9697 296.4541 319.1134 351.2377 381.6855 414.3513 510.9883 558.4132 574.6986 625.1739 751.2032 788.2416 810.9213 811.9949 815.5440 835.2896 884.6457 901.8448 917.2615 984.2007 1022.1942 1030.7551 1042.8756 1051.2757 1058.3067 1093.0488 1102.0995 1107.9573 1113.3766 1120.0536 1134.3746 1136.1565 1137.6520 1144.2190 1158.5408 1216.1080 1246.7656 1251.7511 1252.8664 1269.4623 1316.2208 1334.4630 1347.6067 1355.9363 1363.1195 1382.3326 1385.7352 1393.0270 1398.3403 1399.1239 1425.9422 1452.6733 1453.8691 1457.4471 1459.8367 1460.6949 1478.1089 1478.8146 1481.8812 1482.8647 1493.3775 1497.3573 1499.7491 2917.7662 2934.7129 2943.4196 2948.6789 2951.6893 2989.5089 2992.1475 2992.7018 3000.8884 3011.2932 3014.1341 3022.5266 3034.8903 3037.5134 3086.8424 3089.6945 3089.8135 3095.7622 3098.4556 3099.3689 3099.7132 3112.3407
redmass: 3.0077 2.8660 2.7470 3.0543 2.2751 1.9856 2.6512 2.2883 2.9781 2.2397 2.8043 2.1036 1.6337 2.6114 1.6624 1.1797 1.8751 1.4738 4.0635 3.1520 3.7512 3.3773 3.2640 3.9509 2.9527 3.7970 3.4204 3.2015 2.7692 1.1159 1.0856 1.1142 2.7237 3.0653 4.8660 3.2839 4.6721 2.5151 3.7119 2.9870 3.0350 3.5931 3.3653 2.2789 1.7677 1.5140 2.1013 1.4257 1.7404 1.4395 1.6337 1.6954 1.4501 1.1526 1.1531 1.1519 1.2497 1.2323 1.1811 1.2301 1.4494 1.2766 1.3698 1.2349 1.2583 1.3209 1.3170 1.1555 1.0869 1.0530 1.0413 1.0415 1.0408 1.0490 1.0494 1.0449 1.0496 1.0814 1.0802 1.0840 1.0815 1.0424 1.0564 1.0596 1.0607 1.0359 1.0358 1.0361 1.1047 1.0886 1.0999 1.1011 1.0610 1.0940 1.0990 1.0990 1.0989 1.1011 1.1011 1.1017 1.1012 1.0999
irintensity: 0.1380 0.4901 0.0395 0.6909 2.3600 3.9245 0.8015 1.4234 2.9442 17.3496 1.3337 7.4064 4.3257 0.6997 0.8873 0.1003 3.0546 4.7091 0.1717 2.1569 14.0939 1.1748 7.1982 2.3438 16.8298 10.9906 1.4829 18.4537 27.0945 2.6788 3.6841 4.7702 5.7369 52.3227 65.1262 83.3555 175.3079 32.8253 142.6266 113.4742 10.2221 214.3817 9.8062 41.9062 3.2827 4.6524 26.1273 4.9338 25.0738 5.1327 6.4959 4.2597 1.5205 1.0311 1.5142 1.7502 1.5030 3.5218 27.1556 15.6495 47.0351 9.5937 25.1090 20.0644 22.8995 14.0938 9.2970 6.8901 15.1610 11.7704 10.8252 8.9615 10.8803 3.5313 8.2930 4.0226 16.0772 9.0910 3.1657 0.8805 38.8241 23.4598 117.4043 50.8319 51.4752 28.3596 28.5739 24.7376 36.6626 40.0287 18.7849 29.3953 9.1523 52.9252 33.5855 29.9921 40.2618 43.3735 40.3580 5.7072 55.5143 29.2304
temp: 298.150 k
press: 1.00000 atm
elementType: 8 8 8 8 6 6 6 6 6 6 6 6 6 6 1 1 1 1 1 1 1 1 1 1 1 1 1 1 1 1 1 1 1 1 1 1
symmnumber: 1
zpe: 820135.2 jmol-1
zpe.correction: 0.312373 hartree
zpe.thermalcorrener: 0.331101 hartree
zpe.thermalcorrenthalpy: 0.332045 hartree
zpe.thermalcorrgfe: 0.263006 hartree
zpe.sumelectzpe: -693.920506 hartree
zpe.sumelectthermal: -693.901778 hartree
zpe.sumelectthermalent: -693.900834 hartree
zpe.sumelectthermalfe: -693.969873 hartree
dipole: -0.1003 1.3972 2.2543
dipole: 2.6541
quadrupole: -75.7264 -83.3006 -92.0005
quadrupole: -4.2706 -1.9395 -2.3627
quadrupole: 7.9495 0.3752 -8.3246 -4.2706 -1.9395 -2.3627
hfenergy: -694.232879 hartree
pointgroup: C01 [X(C10H22O4)]
dipole: -0.1051877 0.3891091 0.9632506 debye
polarizability: 139.8993817|-6.1538317|121.5719313|2.5044986|-2.0943691|116.9843865 unknown
InChI: InChI=1S/C10H22O4/c1-5-12-9(11-4)8-10(13-6-2)14-7-3/h9-10H,5-8H2,1-4H3
charge 0 multiplicity 1
36 atoms
O  2.226348 -0.749963 -0.730855
O  1.000702 0.445082 0.986315
O  -2.015629 -0.515664 -0.405578
O  -1.914179 1.184772 -2.104587
C  0.120814 0.194813 -1.362691
C  0.913694 -0.42012 -0.205582
C  -1.273553 0.643238 -0.921581
C  3.013608 -1.632384 0.159776
C  1.665555 1.749464 0.764611
C  -2.565401 -0.338907 0.957671
C  4.362443 -1.871993 -0.515907
C  1.998251 2.322182 2.142547
C  -3.277213 1.664452 -1.856337
C  -3.29176 -1.633619 1.319368
H  0.00407 -0.565149 -2.154135
H  0.668256 1.048968 -1.797643
H  0.404299 -1.318671 0.194488
H  -1.234441 1.419908 -0.121371
H  3.130877 -1.147728 1.149408
H  2.460303 -2.58559 0.303598
H  2.577802 1.59532 0.156025
H  0.986292 2.4306 0.209422
H  -1.73627 -0.132184 1.665361
H  -3.265508 0.524186 0.976082
H  4.989857 -2.539975 0.102309
H  4.222648 -2.338964 -1.506097
H  4.900498 -0.918571 -0.657828
H  2.478565 3.31312 2.043196
H  1.082637 2.43757 2.748969
H  2.686561 1.651262 2.685427
H  -3.292745 2.43612 -1.056002
H  -3.619192 2.110768 -2.802697
H  -3.94324 0.827379 -1.574775
H  -3.725002 -1.561323 2.333909
H  -4.105916 -1.837134 0.602313
H  -2.593128 -2.487861 1.297273
