program: Gaussian 09
title: 000223782
version: EM64L-G09RevD.01
frameworkgroup: C1[X(C12H11N3O2)]
method: RPBEPBE
basis: SDD
operation: Freq
keyword: #p
keyword: freq=noraman
keyword: PBEPBE/SDD
title: #p freq=noraman PBEPBE/SDD
converged: YES YES NO NO
title: Mulliken charges:
elementType: O O N N N C C C C C C C C C C C C H H H H H H H H H H H
charge: -0.308217 -0.224674 -0.027750 0.040913 -0.385911 0.280346 -0.051500 0.340233 -0.363560 -0.303051 -0.298537 -0.256615 -0.226550 -0.376113 -0.365356 0.322854 -0.494011 0.210019 0.263752 0.277901 0.229085 0.233826 0.241943 0.204567 0.311537 0.234181 0.245110 0.245581
chargesum: 0.00000
title: Mulliken charges with hydrogens summed into heavy atoms:
elementType: O O N N N C C C C C C C C C C C C
charge: -0.308217 -0.224674 -0.027750 0.040913 -0.074374 0.280346 -0.051500 0.340233 -0.153541 -0.039300 -0.020637 -0.027531 0.007276 -0.134170 -0.160790 0.322854 0.230861
polarizability: 3.15458551e+02 9.90450406e+00 1.79232380e+02 -1.32349649e-02 3.75923262e-02 6.65769523e+01
1716.lowfreq: -11.2054 0.0006 0.0006 0.0009 3.3260 5.7802 29.6302 43.4014 53.3215
frequency: 29.6270 43.3996 53.3157 61.2025 93.3602 146.4412 159.4523 173.9320 191.6180 208.1221 224.5453 286.4777 313.1039 361.0704 431.4211 448.4363 469.8387 492.1014 510.5661 538.6957 576.5983 636.6630 647.6119 655.2025 670.0450 691.5434 761.3292 768.6388 796.5595 808.1025 853.7993 869.2878 885.6266 915.3601 922.8707 964.6037 985.6668 997.1756 1004.6650 1013.0162 1029.0889 1084.1413 1120.5948 1125.3713 1142.9305 1150.0585 1171.5049 1182.8507 1221.0187 1255.7442 1272.5956 1322.3253 1347.6537 1380.0356 1385.8287 1427.8698 1432.5629 1450.9593 1452.5183 1468.1817 1495.8698 1522.4470 1543.8825 1560.3935 1586.5322 1621.7737 1698.4477 3005.2433 3015.9417 3106.7238 3128.4708 3130.0192 3141.7906 3149.6945 3157.7204 3172.2879 3173.6463 3403.0893
redmass: 3.8663 4.4596 5.1542 1.2776 3.6495 3.4541 5.5621 4.3177 4.8190 6.9723 3.4258 4.4221 5.4036 6.7949 2.9847 5.3929 3.2175 6.4222 6.9928 7.7250 3.4811 6.6256 1.4109 2.5047 6.0699 9.8245 5.6803 1.4094 2.6223 5.6671 5.5890 1.4265 1.5631 7.3048 1.5945 1.3708 1.4309 1.3331 6.6964 4.0248 2.1080 2.4351 1.2601 5.6471 1.5729 1.4615 1.7053 1.5495 1.9124 1.6431 2.2363 3.5470 1.5788 3.3183 1.9274 1.1859 2.6343 2.5666 1.0491 1.0631 2.2390 2.8457 6.7369 5.5237 6.6652 6.3430 9.8304 1.0298 1.0867 1.1049 1.0849 1.0901 1.0896 1.1045 1.0955 1.0950 1.0992 1.0752
irintensity: 3.4254 1.0070 1.2251 3.3368 1.0336 7.9419 1.1375 4.4662 0.7857 6.8792 19.7725 30.2655 6.2065 4.6407 8.6244 1.7449 0.0234 2.0168 0.1284 3.6156 3.1794 16.7705 63.5546 9.2002 11.3556 35.2062 5.9476 80.0414 12.2665 4.7796 0.2729 6.1476 15.3012 10.8149 44.0245 4.9615 0.6466 0.2139 193.2872 2.2877 8.7563 5.2965 2.1407 226.3361 267.9390 62.5051 329.3555 161.3625 2.8098 2.4782 15.2875 16.0105 5.3800 1.5010 41.3407 10.2180 20.7891 10.5451 14.3790 44.7079 239.7168 213.0731 14.5186 36.1837 12.7339 1.8905 389.3294 52.7289 39.1058 26.8561 0.7320 24.9526 17.7526 16.8971 26.2586 4.5499 21.6316 4.0301
temp: 298.150 k
press: 1.00000 atm
elementType: 8 8 7 7 7 6 6 6 6 6 6 6 6 6 6 6 6 1 1 1 1 1 1 1 1 1 1 1
symmnumber: 1
zpe: 554462.6 jmol-1
zpe.correction: 0.211184 hartree
zpe.thermalcorrener: 0.226227 hartree
zpe.thermalcorrenthalpy: 0.227171 hartree
zpe.thermalcorrgfe: 0.167036 hartree
zpe.sumelectzpe: -777.348749 hartree
zpe.sumelectthermal: -777.333706 hartree
zpe.sumelectthermalent: -777.332762 hartree
zpe.sumelectthermalfe: -777.392897 hartree
dipole: 2.1134 -5.1164 -0.0315
dipole: 5.5358
quadrupole: -82.6844 -94.4519 -102.0172
quadrupole: -1.5107 -0.1070 -0.0395
quadrupole: 10.3668 -1.4008 -8.9660 -1.5107 -0.1070 -0.0395
hfenergy: -777.5599329 hartree
pointgroup: C01 [X(C12H11N3O2)]
dipole: 0.8610678 1.99845 -0.090799 debye
polarizability: 315.1260983|-11.9721099|179.2977876|-1.1111172|-5.3679273|66.8439979 unknown
InChI: InChI=1S/C12H11N3O2/c1-17-12(16)15-14-8-9-6-7-13-11-5-3-2-4-10(9)11/h2-8,15H,1H3
charge 0 multiplicity 1
28 atoms
O  5.136285 0.938143 -0.092896
O  4.419358 -1.309283 0.00252
N  -3.067082 -1.873889 0.096148
N  1.775774 -0.21013 -0.021671
N  2.925284 0.540573 -0.060709
C  -1.922469 0.348393 -0.021078
C  -3.111869 -0.486725 0.027603
C  -0.636197 -0.320886 0.004091
C  -2.098593 1.770351 -0.091039
C  -4.407913 0.123615 0.00492
C  -0.622042 -1.727787 0.073522
C  -3.375246 2.33771 -0.111883
C  -4.541326 1.510458 -0.063676
C  -1.845872 -2.450688 0.116881
C  0.623989 0.433188 -0.039841
C  4.175464 -0.089701 -0.044855
C  6.538458 0.469466 -0.08527
H  -1.229672 2.43559 -0.129877
H  -5.273785 -0.544233 0.043421
H  0.336367 -2.253718 0.093617
H  -3.486462 3.426366 -0.165346
H  -5.535253 1.970271 -0.081068
H  -1.832485 -3.54553 0.170968
H  0.578252 1.536376 -0.084217
H  2.918264 1.570557 -0.101959
H  7.141097 1.387896 -0.114122
H  6.735809 -0.161797 -0.967935
H  6.743465 -0.110986 0.82985
