program: Gaussian 09
title: 000019014
version: EM64L-G09RevD.01
frameworkgroup: C1[X(C8H2Cl4N2)]
method: RPBEPBE
basis: SDD
operation: Freq
keyword: #p
keyword: freq=noraman
keyword: PBEPBE/SDD
title: #p freq=noraman PBEPBE/SDD
converged: NO NO NO NO
title: Mulliken charges:
elementType: Cl Cl Cl Cl N N C C C C C C C C H H
charge: 0.070417 0.070417 0.070804 0.070805 0.029219 0.029217 0.233241 0.233237 -0.284961 -0.284957 -0.101346 -0.101337 -0.272262 -0.272261 0.254884 0.254884
chargesum: 0.00000
title: Mulliken charges with hydrogens summed into heavy atoms:
elementType: Cl Cl Cl Cl N N C C C C C C C C
charge: 0.070417 0.070417 0.070804 0.070805 0.029219 0.029217 0.233241 0.233237 -0.284961 -0.284957 -0.101346 -0.101337 -0.017378 -0.017377
polarizability: 2.13945396e+02 -5.66988564e-04 1.74608483e+02 3.26180875e-03 -1.51833912e-03 4.85721469e+01
1716.lowfreq: -0.0030 -0.0029 -0.0014 3.9307 8.9734 9.0775 62.6081 68.7246 104.1263
frequency: 62.5986 68.7198 104.1257 142.8335 199.1856 200.6714 215.9422 219.4053 300.1319 310.4098 319.8469 326.4361 365.5560 456.7844 460.0895 546.3006 592.0114 621.0925 623.5212 685.3321 704.3627 738.8097 860.0545 868.0435 897.9662 901.5063 947.9599 957.3341 1037.7734 1153.1729 1209.1299 1263.4853 1298.8110 1325.6505 1384.8300 1400.2655 1427.6802 1496.8207 1522.7477 1554.9593 3138.5051 3161.3116
redmass: 16.5821 19.0078 7.9946 8.4126 22.4313 24.3128 34.8004 10.8044 8.2147 26.5077 8.1788 25.3189 15.7302 11.5636 12.6283 4.2378 10.8475 11.6708 9.4120 11.5532 7.6074 12.5664 12.1633 1.2261 9.2408 11.6736 9.6228 1.5012 2.6342 4.6989 7.0188 8.9120 3.0384 2.6573 6.4325 2.5162 3.5801 9.0513 7.1318 11.1712 1.0890 1.0978
irintensity: 0.2667 0.0000 0.0000 2.2454 0.4194 0.0948 0.0001 1.9554 2.6881 0.0140 0.0000 1.0800 4.0326 0.1850 8.0032 0.0000 3.9966 20.6954 0.9313 45.2676 0.0000 30.9636 0.0000 28.8014 26.8312 0.6500 36.2470 0.0000 25.0014 25.5486 71.4018 9.3666 10.4448 128.6524 54.4409 24.7267 45.8632 0.9277 1.7244 25.7251 1.1833 32.0572
temp: 298.150 k
press: 1.00000 atm
elementType: 17 17 17 17 7 7 6 6 6 6 6 6 6 6 1 1
symmnumber: 1
zpe: 215759.5 jmol-1
zpe.correction: 0.082178 hartree
zpe.thermalcorrener: 0.094095 hartree
zpe.thermalcorrenthalpy: 0.095039 hartree
zpe.thermalcorrgfe: 0.042495 hartree
zpe.sumelectzpe: -2254.792707 hartree
zpe.sumelectthermal: -2254.780790 hartree
zpe.sumelectthermalent: -2254.779846 hartree
zpe.sumelectthermalfe: -2254.832390 hartree
dipole: 2.2390 0.0000 0.0001
dipole: 2.2390
quadrupole: -92.0091 -115.2002 -106.7822
quadrupole: -0.0004 0.0004 0.0000
quadrupole: 12.6548 -10.5364 -2.1184 -0.0004 0.0004 0.0000
hfenergy: -2254.8748851 hartree
pointgroup: C01 [X(C8H2Cl4N2)]
dipole: 0.8808732 0.0001034 0.0000456 debye
dipolederiv: 0.003838 0.0026612 -0.0000005 0.0758362 -0.7455594 0.0000036 0.0000025 -0.000026 0.015234 0.0038536 -0.0024968 -0.0000001 -0.0756675 -0.7455761 0.0000274 0.0000044 0.0000618 0.0152334 -0.5713364 0.2575231 0.0000052 0.3350011 -0.1374002 -0.0000029 0.000017 -0.0000117 0.0198051 -0.5711983 -0.2576219 -0.0000023 -0.3350973 -0.1375347 -0.0000025 0.0000329 0.00001 0.0198051 -0.1012956 -0.0595526 0.0000121 0.0499117 -0.2185524 0.0000038 0.0000144 0.0000052 -0.2349468 -0.1012912 0.059582 0.0000012 -0.0498856 -0.2185492 -0.0000071 -0.000003 0.0000047 -0.2349471 0.1384422 0.1207079 -0.000005 -0.4416294 -0.2502047 -0.0000092 0.0000043 -0.0000147 0.1306631 0.1383598 -0.1206179 0.0000088 0.4417181 -0.2501246 0.0000233 -0.0000266 0.0000191 0.130664 -0.2316062 0.0249114 0.000004 0.0210816 1.1315301 0.0000008 0.000003 0.0000399 -0.0656522 -0.2315893 -0.0252236 -0.0000031 -0.0213883 1.131517 -0.0000518 0.0000238 -0.0001007 -0.0656509 0.7279657 -0.5959497 -0.0000161 -0.6554688 0.017953 0.0000025 -0.0000103 -0.0000021 -0.0197188 0.7276745 0.5961163 -0.0000044 0.655627 0.0182388 0.0000136 -0.0000574 0.0000202 -0.0197189 0.1031376 0.1264688 -0.0000094 0.488516 0.1370128 0.0000165 -0.0000275 0.0000029 0.026503 0.1032762 -0.1264775 0.000027 -0.4885232 0.1368683 -0.0000217 0.0000514 -0.0000168 0.0265026 -0.0690995 -0.0515453 -0.000004 -0.0834425 0.0651749 -0.0000023 -0.0000045 -0.0000011 0.1281123 -0.069131 0.0515145 -0.0000134 0.0834109 0.0652064 0.0000062 -0.0000245 0.0000093 0.1281123 unknown
polarizability: 213.9453951|0.0047801|174.6084836|0.003262|-0.0015179|48.5721469 unknown
InChI: InChI=1S/C8H2Cl4N2/c9-3-4(10)6(12)8-7(5(3)11)13-1-2-14-8/h1-2H
charge 0 multiplicity 1
16 atoms
Cl -0.468017 3.224292 0.000012
Cl -0.467288 -3.224439 0.000115
Cl -3.251941 1.599401 0.000036
Cl -3.251566 -1.600198 -0.000001
N  1.958708 1.435227 0.000073
N  1.95904 -1.434812 0.000106
C  0.769257 0.728018 0.000014
C  0.769426 -0.727878 0.000017
C  -0.481733 1.429177 -0.000026
C  -0.481401 -1.429329 -0.000014
C  -1.68585 0.718248 -0.000027
C  -1.685679 -0.718688 -0.000049
C  3.09797 0.717612 0.000124
C  3.098136 -0.716932 0.000143
H  4.03732 1.280492 0.000138
H  4.037618 -1.279592 0.000239
