program: Gaussian 09
title: 000223779
version: EM64L-G09RevD.01
frameworkgroup: C1[X(C11H13NO4)]
method: RPBEPBE
basis: SDD
operation: Freq
keyword: #p
keyword: freq=noraman
keyword: PBEPBE/SDD
title: #p freq=noraman PBEPBE/SDD
converged: YES YES NO NO
title: Mulliken charges:
elementType: O O O O N C C C C C C C C C C C H H H H H H H H H H H H H
charge: -0.276214 -0.438200 -0.205236 -0.260348 -0.618928 0.199320 -0.358549 -0.725581 0.172038 0.215232 0.217687 -0.345010 -0.341065 -0.219957 -0.218224 -0.221991 0.238481 0.256335 0.235792 0.238145 0.241155 0.303020 0.276078 0.269381 0.284979 0.382985 0.233350 0.232847 0.232480
chargesum: 0.00000
title: Mulliken charges with hydrogens summed into heavy atoms:
elementType: O O O O N C C C C C C C C C C C
charge: -0.276214 -0.055215 -0.205236 -0.260348 -0.039831 0.199320 0.136267 -0.010489 0.172038 0.215232 0.217687 -0.075629 -0.056086 0.013393 0.014623 0.010489
polarizability: 1.85667164e+02 9.53871402e+00 1.40855298e+02 1.12517940e+01 -5.74562564e+00 8.43714662e+01
1716.lowfreq: -5.2903 -0.0005 0.0004 0.0005 2.9882 6.9501 30.2498 34.8880 40.1459
frequency: 30.1668 34.7808 40.1322 50.7931 72.1108 137.2379 157.3546 206.0048 226.0228 249.0919 268.0266 275.5830 302.0872 314.1807 353.1718 362.4512 403.8479 419.2095 440.0952 502.2287 530.2714 572.7206 590.0137 613.9033 652.0817 656.6568 678.3462 698.5901 702.5219 727.9323 765.4333 795.8739 853.2961 866.5543 923.5582 953.6362 957.5976 982.6075 990.1053 998.1861 1009.5944 1018.6829 1031.4904 1056.7666 1076.2514 1088.3043 1112.3116 1173.8394 1182.6696 1191.4156 1241.6861 1258.9019 1268.7992 1315.8315 1343.8975 1366.1720 1381.2259 1390.1694 1438.2106 1441.9689 1460.5276 1477.7574 1483.0273 1584.7059 1611.0982 1621.7027 1631.6553 1676.8882 2987.5417 3033.3154 3087.7145 3103.4349 3129.2038 3130.2632 3143.2106 3155.3378 3167.3019 3178.8944 3452.7583 3519.9233 3585.0923
redmass: 6.3566 4.5270 6.8772 5.5563 6.8529 5.5182 5.0651 4.3660 2.7385 1.8153 1.6382 2.4761 1.5499 5.0048 2.7404 2.5278 2.8338 5.8597 3.7731 4.8820 3.1906 2.7384 1.5142 6.4350 1.5770 4.3807 5.0459 3.5932 1.7366 5.2076 5.3001 2.1567 2.6514 1.2441 3.5346 2.2821 1.4171 1.6011 6.2370 1.3838 1.3286 3.0637 2.4995 2.4698 1.4589 1.8210 4.7762 1.0589 1.1364 2.3433 3.5071 1.3926 1.8344 1.3155 2.2615 1.2593 1.2214 10.0623 2.2254 1.0978 1.0662 2.2675 1.0723 6.6725 6.1233 7.3425 1.1337 9.3484 1.0347 1.0610 1.1000 1.1008 1.1043 1.0855 1.0891 1.0940 1.0980 1.0979 1.0447 1.0642 1.0981
irintensity: 1.7053 0.2106 2.8878 1.4672 0.7754 0.3642 0.2226 1.3614 1.0062 0.8816 21.0739 7.6817 32.3253 11.4189 18.2176 18.1468 0.0296 8.9069 1.5787 33.2056 40.1989 23.8758 14.4700 0.6126 292.5444 57.8393 20.9847 11.9010 97.1419 11.4685 8.2364 22.2134 7.6919 0.0061 4.9338 13.2766 5.1355 35.9664 2.8564 0.0505 0.8083 266.0938 240.1010 77.3354 45.4363 41.7184 13.6290 0.7307 46.0745 20.4994 295.8603 15.9469 11.5299 1.6391 10.5772 28.8484 18.4589 3.2031 15.6472 16.1910 15.3950 5.1177 22.1006 33.5632 11.5232 167.9424 24.4167 207.8958 11.3334 24.1583 19.5876 22.1326 3.8517 0.4311 11.3937 15.9409 19.3996 8.7464 5.2826 26.2551 6.0993
temp: 298.150 k
press: 1.00000 atm
elementType: 8 8 8 8 7 6 6 6 6 6 6 6 6 6 6 6 1 1 1 1 1 1 1 1 1 1 1 1 1
symmnumber: 1
zpe: 591936.2 jmol-1
zpe.correction: 0.225457 hartree
zpe.thermalcorrener: 0.241245 hartree
zpe.thermalcorrenthalpy: 0.242190 hartree
zpe.thermalcorrgfe: 0.180707 hartree
zpe.sumelectzpe: -781.434395 hartree
zpe.sumelectthermal: -781.418606 hartree
zpe.sumelectthermalent: -781.417662 hartree
zpe.sumelectthermalfe: -781.479145 hartree
dipole: -0.4880 0.8227 2.1114
dipole: 2.3179
quadrupole: -71.5145 -91.4415 -96.8633
quadrupole: 3.0231 -3.5389 1.5919
quadrupole: 15.0919 -4.8351 -10.2569 3.0231 -3.5389 1.5919
hfenergy: -781.6598517 hartree
pointgroup: C01 [X(C11H13N1O4)]
dipole: -0.1306617 0.5210169 0.7369574 debye
polarizability: 187.2355305|8.5068117|133.9495367|2.9643313|-19.0085652|89.7088606 unknown
InChI: InChI=1S/C11H13NO4/c1-11(12,10(14)15)7-16-9(13)8-5-3-2-4-6-8/h2-6,14H,7,12H2,1H3
charge 0 multiplicity 1
29 atoms
O  -0.377599 -0.203001 -0.630459
O  -4.137128 1.71126 0.778734
O  -2.614227 1.953251 -0.95461
O  0.427848 -2.178732 0.330855
N  -3.918713 -1.00417 0.308647
C  -2.686936 -0.179646 0.357261
C  -1.7399 -0.77616 -0.715025
C  -2.009533 -0.131599 1.760579
C  -3.096269 1.248541 -0.048186
C  0.633121 -1.014158 -0.095552
C  1.953138 -0.320933 -0.106721
C  3.076808 -1.018016 0.409345
C  2.104552 0.997049 -0.61265
C  4.344437 -0.401634 0.419221
C  3.375935 1.608458 -0.600266
C  4.495935 0.91253 -0.085443
H  -1.676573 -1.87026 -0.575243
H  -2.102282 -0.530623 -1.723511
H  -1.13515 0.542988 1.776563
H  -1.66506 -1.146038 2.031203
H  -2.737329 0.216607 2.512582
H  -4.716239 -0.569244 0.783472
H  -3.764681 -1.975383 0.600092
H  2.933699 -2.033677 0.792804
H  1.229897 1.520175 -1.009085
H  -4.394171 2.63151 0.500679
H  5.211547 -0.940076 0.81652
H  3.495353 2.624522 -0.991563
H  5.481723 1.391258 -0.078441
