program: Gaussian 09
title: 000223774
version: EM64L-G09RevD.01
frameworkgroup: C1[X(C8H10N2O2S)]
method: RPBEPBE
basis: SDD
operation: Freq
keyword: #p
keyword: freq=noraman
keyword: PBEPBE/SDD
title: #p freq=noraman PBEPBE/SDD
converged: YES YES NO NO
title: Mulliken charges:
elementType: S O O N N C C C C C C C C H H H H H H H H H H
charge: 0.311761 -0.315339 -0.228751 -0.007956 -0.390821 -0.217443 0.237117 -0.287145 -0.791408 -0.141880 -0.521399 0.313466 -0.494979 0.236897 0.253228 0.243069 0.244290 0.244838 0.264856 0.330917 0.242734 0.230308 0.243638
chargesum: 0.00000
title: Mulliken charges with hydrogens summed into heavy atoms:
elementType: S O O N N C C C C C C C C
charge: 0.311761 -0.315339 -0.228751 -0.007956 -0.059904 -0.217443 0.237117 -0.050247 -0.050821 0.102959 -0.256542 0.313466 0.221700
polarizability: 2.42804565e+02 -2.33832156e+00 1.27563669e+02 -9.15784692e-04 4.10766966e-02 5.86097312e+01
1716.lowfreq: -7.9709 -2.3890 -0.0013 0.0017 0.0020 6.6632 42.6224 46.6063 64.7478
frequency: 42.6204 46.6047 64.7475 70.1166 88.0294 131.9036 143.0187 167.0317 189.2890 265.4574 276.1706 322.3389 325.2394 384.6101 460.5135 514.5043 537.3465 585.2691 594.8240 626.3388 640.6106 685.6559 689.1720 703.8943 712.1421 816.7903 820.9292 893.5893 907.1562 944.8960 1003.2169 1023.4985 1031.2432 1066.6729 1094.9620 1120.3818 1126.4704 1146.3687 1174.0995 1222.5059 1312.2566 1349.9423 1395.0623 1425.7614 1451.5259 1453.9785 1468.7910 1471.2614 1481.0855 1499.5165 1547.7720 1558.5993 1700.0613 2970.4472 3001.8466 3041.9047 3102.0790 3127.4394 3144.2233 3168.8394 3186.9316 3233.6876 3450.0181
redmass: 5.5884 4.5293 5.7915 1.3007 2.2567 1.7233 1.9887 6.0590 3.9277 4.3912 5.1749 5.2358 3.8137 6.2951 3.9033 7.0475 2.8847 2.8025 5.4828 1.4498 7.0007 6.0395 11.9210 1.1669 4.6674 4.6607 1.3375 4.5165 1.3657 6.3664 6.7098 1.9110 1.5371 1.7545 1.1418 1.2595 5.6116 1.5975 2.3259 1.5322 2.9925 2.9934 1.2262 1.1481 1.0515 1.2519 2.1717 1.4607 1.0456 1.6533 6.0785 5.2722 9.8736 1.0411 1.0298 1.0981 1.1047 1.0936 1.1043 1.0893 1.0968 1.1003 1.0748
irintensity: 1.2797 3.4331 1.4324 2.6953 0.4651 2.5087 3.3288 4.1934 5.0286 1.6501 19.1714 5.7918 5.3164 1.5049 0.9329 1.4356 12.2183 23.2609 0.9755 62.7345 3.2900 0.7624 21.3517 113.7732 22.3682 6.4487 14.8741 5.1984 0.0292 27.0597 202.7795 8.6173 4.1590 1.0788 13.2623 2.1696 279.7827 186.2723 348.4952 10.1981 9.6169 5.1075 25.8875 2.2706 16.3620 223.0289 9.8812 23.8585 17.0531 148.8657 78.7472 4.1287 377.4214 14.5633 55.8174 14.9082 29.1481 9.7188 19.1263 10.5543 8.7593 0.6876 10.4769
temp: 298.150 k
press: 1.00000 atm
elementType: 16 8 8 7 7 6 6 6 6 6 6 6 6 1 1 1 1 1 1 1 1 1 1
symmnumber: 1
zpe: 449815.4 jmol-1
zpe.correction: 0.171326 hartree
zpe.thermalcorrener: 0.185123 hartree
zpe.thermalcorrenthalpy: 0.186067 hartree
zpe.thermalcorrgfe: 0.129139 hartree
zpe.sumelectzpe: -967.851262 hartree
zpe.sumelectthermal: -967.837465 hartree
zpe.sumelectthermalent: -967.836520 hartree
zpe.sumelectthermalfe: -967.893449 hartree
dipole: -0.0339 4.5512 0.0006
dipole: 4.5513
quadrupole: -60.4909 -79.9784 -86.3816
quadrupole: 3.4830 -0.0022 0.0240
quadrupole: 15.1261 -4.3615 -10.7646 3.4830 -0.0022 0.0240
hfenergy: -968.0225876 hartree
pointgroup: C01 [X(C8H10N2O2S1)]
dipole: -0.0698846 1.7886638 0.0466412 debye
dipolederiv: 0.0566381 0.1541929 0.0033137 0.0498594 -0.1638179 -0.0080348 -0.0001273 -0.0064733 0.1493906 -2.0712096 -0.0500682 -0.0272293 -0.5181074 -0.5472981 -0.012776 -0.032283 -0.0065204 -0.3292411 -0.7296698 0.074251 -0.0040548 0.5058232 -0.9907808 -0.009216 0.008283 -0.015756 -0.3231595 0.8918188 -0.1246788 0.0117535 0.6596827 -0.3547741 0.0031889 0.0307521 -0.0082705 -0.109228 -2.1744402 0.3957932 -0.017016 0.2191591 -0.2934107 0.0042525 -0.0213303 0.006007 -0.3249274 -0.1753208 -0.0809 -0.0026223 0.0206515 0.2493498 0.0126401 0.0018323 0.0108385 -0.171005 0.3221726 0.1672586 0.0087236 0.2487799 0.4427155 0.0139852 0.0092863 0.0137813 0.0358577 0.0424821 0.1617643 0.0074738 0.1085041 -0.0257277 0.0056515 0.0068527 0.0065753 -0.1643857 -0.0417517 -0.0658763 -0.0043341 -0.0857447 -0.2170601 -0.0096171 -0.0044493 -0.0101451 0.1057093 0.02742 -0.0125055 0.002151 -0.2297849 -0.2231284 -0.0052377 -0.0049694 -0.0020159 -0.1565734 -0.1601558 -0.2235158 -0.0044523 -0.1088902 0.0411181 0.0086602 -0.0011431 0.0067485 -0.3144221 3.0110855 -0.2386815 0.0317487 -0.7850045 1.4938348 0.0180131 0.0153191 0.0269271 0.321523 0.9218063 -0.0676211 0.0099965 -0.2423635 0.2484823 -0.0058231 0.0022563 -0.0036924 0.2830295 0.1357684 0.0186714 -0.0001433 0.004652 -0.092338 -0.0079795 -0.0004489 -0.0078066 0.1913207 -0.0495709 0.1515526 -0.0009215 0.0653451 0.0933434 0.0007216 -0.0025852 0.0023947 0.118841 0.0411124 -0.0867812 0.1083245 -0.0101706 0.0350609 0.0117068 0.0696094 0.059081 -0.0217562 0.0505988 -0.0775167 -0.1077021 -0.0051621 0.0378283 -0.00967 -0.0663364 -0.0593762 -0.0337849 -0.0907448 0.0402731 -0.0028032 0.0778226 0.0920991 -0.0020046 -0.0017309 -0.0024784 0.198309 0.0375273 -0.0613867 -0.0042089 -0.0415266 0.0354545 -0.0057334 -0.0031746 -0.0059286 0.2175037 0.0597601 -0.0094059 -0.0040556 -0.0469575 0.0899577 -0.006733 -0.0039828 -0.0061315 0.3267188 -0.0165534 0.0044117 0.0154017 0.12745 0.0285821 0.1032815 -0.0419981 0.0936243 -0.0614818 -0.0768224 -0.0747497 -0.0026823 -0.1417843 -0.0123074 -0.0015846 -0.0033261 -0.0010823 0.1233896 -0.0119509 0.0055186 -0.0166613 0.1277666 0.0328168 -0.0976918 0.0436943 -0.0903005 -0.0616277 unknown
polarizability: 242.7987757|1.2335282|127.4794574|2.6946258|1.8847765|58.6997324 unknown
InChI: InChI=1S/C8H10N2O2S/c1-6(7-4-3-5-13-7)9-10-8(11)12-2/h3-5,10H,1-2H3
charge 0 multiplicity 1
23 atoms
S  -2.161703 -1.595103 -0.095785
O  3.904694 0.442685 0.045547
O  2.779555 -1.633507 -0.020825
N  0.379075 -0.058192 -0.015302
N  1.657617 0.465458 0.017073
C  -1.972465 0.210607 -0.042578
C  -0.6384 0.797647 -0.008517
C  -3.223001 0.834981 -0.041414
C  -0.469611 2.309049 0.032362
C  -4.333927 -0.078233 -0.08249
C  -3.943696 -1.4089 -0.115173
C  2.761009 -0.388567 0.010055
C  5.188213 -0.287351 0.048442
H  -3.354532 1.919194 -0.012258
H  -1.436863 2.829562 0.019714
H  0.109581 2.668502 -0.841305
H  0.064391 2.624865 0.950457
H  -5.378397 0.242171 -0.087488
H  -4.567283 -2.300967 -0.149012
H  1.854086 1.473501 0.045553
H  5.264589 -0.928191 0.94326
H  5.95826 0.497051 0.059476
H  5.276507 -0.915661 -0.853995
