program: Gaussian 09
title: 000223776
version: EM64L-G09RevD.01
frameworkgroup: C1[X(C10H18N4O5)]
method: RPBEPBE
basis: SDD
operation: Freq
keyword: #p
keyword: freq=noraman
keyword: PBEPBE/SDD
title: #p freq=noraman PBEPBE/SDD
converged: YES YES NO NO
title: Mulliken charges:
elementType: O O O O O N N N N C C C C C C C C C C H H H H H H H H H H H H H H H H H H
charge: -0.467219 -0.295468 -0.316335 -0.288243 -0.252711 0.043523 0.024906 -0.387664 -0.403115 -0.399071 -0.415857 -0.074636 -0.458575 -0.273208 -0.218923 0.369068 0.300420 -0.499866 -0.496501 0.227530 0.234790 0.204333 0.222735 0.248824 0.231899 0.211292 0.235457 0.231923 0.343532 0.310507 0.376977 0.233193 0.245620 0.253211 0.241534 0.238507 0.217610
chargesum: 0.00000
title: Mulliken charges with hydrogens summed into heavy atoms:
elementType: O O O O O N N N N C C C C C C C C C C
charge: -0.123687 -0.295468 -0.316335 -0.288243 -0.252711 0.043523 0.024906 -0.077157 -0.026138 0.063250 0.011210 0.174188 -0.015385 -0.037751 0.013000 0.369068 0.300420 0.232158 0.201150
polarizability: 2.31200327e+02 6.35898255e+00 1.29333749e+02 -4.96530173e+00 3.30459209e+00 1.37537533e+02
1716.lowfreq: -4.1229 -0.0007 -0.0001 0.0007 2.2836 10.7718 23.0314 25.3758 55.6026
frequency: 22.9009 25.2668 55.5433 59.0002 66.9634 86.4641 89.7276 98.9053 107.2096 108.9990 124.4891 132.2400 146.8499 170.9543 176.4827 203.2915 211.2996 231.3233 248.7178 259.6487 275.9429 289.7822 313.2141 345.2286 354.0111 370.4233 413.5814 436.6070 510.2798 544.8433 556.5625 608.6032 623.5632 661.7615 679.3690 692.2913 693.7296 733.6886 778.4625 838.0164 856.3689 887.7128 898.3735 904.8736 919.7452 945.6802 982.5908 993.7267 1008.3721 1021.7407 1070.8393 1097.3431 1099.7437 1118.2598 1119.3667 1121.4879 1126.3874 1143.1265 1154.2057 1171.5464 1186.5778 1196.1682 1210.4406 1219.6096 1258.2031 1273.6091 1291.5474 1303.1862 1336.1987 1348.7280 1361.5557 1372.0501 1425.8148 1426.8340 1449.2988 1452.5526 1458.3428 1462.1257 1468.9691 1471.5614 1473.5773 1499.6307 1533.5665 1603.8370 1608.2579 1659.8660 1691.1821 2960.1042 2972.5496 2989.4025 2994.4444 2996.7675 3006.5217 3007.7542 3011.8565 3033.3667 3057.4385 3077.0084 3095.3423 3110.2954 3133.6990 3151.2377 3276.6500 3426.3960 3565.9795
redmass: 5.3213 5.1654 5.9520 3.9650 4.9427 1.8924 4.2310 1.2645 2.6879 2.6511 3.1025 3.2142 2.8646 3.9532 4.3518 3.6703 3.5468 1.1752 3.5621 3.9687 3.2132 5.0899 4.3380 4.8861 4.1416 3.6276 5.0542 2.5299 3.5448 4.1996 4.7574 1.5898 2.2420 4.9842 5.3801 10.8013 9.6426 1.4834 1.2484 2.3852 1.8640 3.4697 1.9700 5.8579 2.4173 2.0255 5.1930 4.5748 2.5104 2.9010 3.4659 4.2148 3.1211 1.4322 2.0505 1.3141 2.4428 1.4736 1.5272 1.2484 2.3575 2.2714 1.4636 1.2234 1.3715 1.1771 1.3741 1.2743 1.3380 1.4723 1.3202 1.3962 1.1589 1.1481 1.0502 1.0492 1.0830 1.0751 1.0584 1.0547 1.0891 1.8050 1.5229 7.0622 9.0686 9.4986 9.5401 1.0828 1.0632 1.0621 1.0887 1.0298 1.0296 1.0824 1.0681 1.0998 1.0983 1.1004 1.1044 1.1051 1.1041 1.1049 1.0810 1.0761 1.0667
irintensity: 4.6361 1.5540 4.9527 0.1831 2.0379 4.5707 7.5682 0.2035 2.6928 13.0910 2.8486 1.5107 1.7526 3.0140 4.3753 6.3574 18.4007 125.2732 29.0434 2.7467 10.5502 31.3525 3.9936 12.7906 1.4895 3.3523 2.0945 15.3604 1.7419 1.3069 3.5218 46.3540 41.1460 21.9750 7.1062 33.2583 14.9242 4.8053 172.5179 24.3530 25.7061 40.6842 29.2278 6.3170 20.2862 34.5233 136.0973 177.6919 1.3769 46.5226 11.9936 17.5550 21.4113 3.3856 3.0600 1.3879 18.7990 95.7874 97.8766 23.8739 68.6128 635.2356 63.5681 44.4096 25.1465 2.2759 56.9381 3.1846 2.1254 10.9981 15.6632 4.2975 11.1913 18.2868 11.4597 11.1461 16.2446 19.4894 34.9576 8.2761 10.7174 207.9639 191.6709 4.3619 11.8008 274.5828 382.6319 12.5105 15.7394 78.4268 36.1837 55.3089 43.4680 14.3460 30.3799 5.9711 32.2930 27.5160 31.1460 23.4189 21.1343 17.0525 207.1736 11.5639 11.9109
temp: 298.150 k
press: 1.00000 atm
elementType: 8 8 8 8 8 7 7 7 7 6 6 6 6 6 6 6 6 6 6 1 1 1 1 1 1 1 1 1 1 1 1 1 1 1 1 1 1
symmnumber: 1
zpe: 764998.9 jmol-1
zpe.correction: 0.291373 hartree
zpe.thermalcorrener: 0.313386 hartree
zpe.thermalcorrenthalpy: 0.314330 hartree
zpe.thermalcorrgfe: 0.238619 hartree
zpe.sumelectzpe: -985.413835 hartree
zpe.sumelectthermal: -985.391821 hartree
zpe.sumelectthermalent: -985.390877 hartree
zpe.sumelectthermalfe: -985.466588 hartree
dipole: -2.0575 -3.7398 0.9497
dipole: 4.3728
quadrupole: -93.2613 -123.2342 -104.4342
quadrupole: 8.8634 -1.4007 -6.1098
quadrupole: 13.7153 -16.2576 2.5424 8.8634 -1.4007 -6.1098
hfenergy: -985.7052073 hartree
pointgroup: C01 [X(C10H18N4O5)]
dipole: -1.6620506 0.4304839 0.1096712 debye
polarizability: 137.615979|-30.0085666|222.277439|2.1487194|0.5065455|138.1781909 unknown
InChI: InChI=1S/C10H18N4O5/c1-18-9(16)13-11-6-4-3-5-8(15)7-12-14-10(17)19-2/h6-8,13-15H,3-5H2,1-2H3
charge 0 multiplicity 1
37 atoms
O  -0.534794 -4.01144 1.757816
O  -2.994773 2.155834 -0.559411
O  0.798628 2.97705 0.218952
O  -1.158907 1.285014 -1.744764
O  2.441425 1.894992 1.518516
N  -1.205663 -0.852712 0.057799
N  2.063574 -0.33876 -0.196192
N  -2.089443 0.210612 0.145872
N  1.445002 0.894585 -0.395377
C  -0.004149 -3.423808 -0.552861
C  1.43243 -3.793003 -0.993379
C  -0.145038 -2.880439 0.888418
C  2.478416 -2.633463 -0.871166
C  -1.180761 -1.762734 0.994115
C  1.897029 -1.258702 -1.116554
C  -1.996137 1.213268 -0.812945
C  1.655845 1.890366 0.546004
C  -2.941941 3.352488 -1.430009
C  0.970552 4.153058 1.093444
H  -0.655721 -4.315626 -0.617852
H  -0.412167 -2.66754 -1.245016
H  1.378025 -4.126816 -2.048316
H  1.801624 -4.658436 -0.410744
H  0.824445 -2.458717 1.229922
H  2.937597 -2.618723 0.133905
H  3.300559 -2.831294 -1.588964
H  -1.837451 -1.761798 1.886893
H  1.313322 -1.087572 -2.04111
H  -0.2151 -3.849464 2.681059
H  -2.784024 0.311987 0.898545
H  0.698551 1.030166 -1.105006
H  -3.745524 4.003442 -1.058526
H  -3.116717 3.067595 -2.480687
H  -1.955791 3.838245 -1.34104
H  1.994713 4.555022 1.006884
H  0.780143 3.8884 2.147692
H  0.232524 4.88432 0.731578
