program: Gaussian 09
title: 000223770
version: EM64L-G09RevD.01
frameworkgroup: C1[X(C8H14N2O3)]
method: RPBEPBE
basis: SDD
operation: Freq
keyword: #p
keyword: freq=noraman
keyword: PBEPBE/SDD
title: #p freq=noraman PBEPBE/SDD
converged: YES YES NO NO
title: Mulliken charges:
elementType: O O O N N C C C C C C C C H H H H H H H H H H H H H H
charge: -0.420687 -0.236197 -0.309135 -0.428640 -0.657661 -0.053377 -0.191337 -0.499851 -0.428618 -0.406353 -0.390250 0.133376 0.262264 0.286562 0.320104 0.255056 0.211746 0.208755 0.239512 0.213479 0.176496 0.202338 0.209550 0.288397 0.375491 0.299147 0.339833
chargesum: 0.00000
title: Mulliken charges with hydrogens summed into heavy atoms:
elementType: O O O N N C C C C C C C C
charge: -0.045196 -0.236197 -0.309135 -0.140243 -0.018681 0.233186 0.128768 -0.033048 0.019649 -0.016379 0.021638 0.133376 0.262264
polarizability: 1.19252755e+02 -4.03378172e+00 1.04909929e+02 4.18635024e+00 7.70731893e-01 9.00918839e+01
1716.lowfreq: -13.0511 0.0005 0.0005 0.0009 8.5043 24.9840 37.5226 54.8317 71.5213
frequency: 36.8426 54.5975 71.5054 84.2616 130.0769 177.1626 205.4903 233.5780 249.0712 288.5275 328.0869 364.2356 404.2477 449.4204 454.7387 476.8488 502.2503 508.3930 555.7154 605.4400 637.0796 652.7182 699.9363 722.6647 779.1527 807.9488 846.1039 867.6466 885.1880 913.3565 951.0744 995.9666 1033.1241 1041.3860 1051.5602 1057.1840 1076.5373 1106.0063 1126.4568 1157.6522 1181.6235 1242.2185 1250.9362 1269.2799 1277.1315 1281.7689 1317.5688 1332.1648 1341.0805 1341.7729 1353.6586 1356.0073 1378.1002 1462.9417 1464.9062 1472.0006 1475.2394 1493.3894 1597.3720 1642.2826 1646.1864 2949.0571 2971.4496 2990.0308 2994.2860 3002.1401 3028.3560 3034.1864 3037.6297 3064.4957 3068.6153 3510.9342 3540.4344 3556.3978 3699.3720
redmass: 8.5975 5.7516 4.3421 5.7446 3.3702 3.4375 4.0925 1.3258 2.5554 2.7811 4.8960 1.8424 3.4206 3.2252 1.2396 2.2018 2.6766 1.1823 2.6364 1.9827 3.7930 2.2277 3.3606 7.1665 2.2174 2.7316 1.9814 2.3430 2.2155 2.4315 1.9921 2.8474 2.3753 2.1204 1.6525 1.7820 1.9358 1.2197 1.6547 2.0463 1.8777 1.3213 1.4414 1.5092 1.6096 1.3827 1.5692 1.5189 1.4804 1.4320 1.5844 1.4799 1.4991 1.1201 1.0854 1.1876 1.1268 1.8793 1.4266 3.0375 8.5584 1.0675 1.0628 1.0675 1.0647 1.0794 1.0913 1.0876 1.0989 1.0986 1.0990 1.0639 1.0480 1.0747 1.1040
irintensity: 0.8732 10.5519 8.7658 3.1890 2.4424 0.6781 10.0745 8.6593 3.4548 2.0795 6.8824 0.9265 4.4598 15.9464 379.2252 1.2850 50.4558 11.0581 44.4426 40.9043 9.6468 53.0423 14.4887 23.2318 0.9071 0.8100 4.5763 7.1087 6.2863 8.0379 20.1571 89.2996 4.2054 178.2816 13.2028 0.8276 16.1672 24.2665 0.7954 2.2965 6.8253 1.7951 12.8181 14.7254 4.9145 17.0644 90.7932 31.7657 13.6472 5.6227 19.6111 9.7468 6.3430 26.9375 2.8634 79.3469 103.2207 328.5234 94.9176 279.3387 202.1457 40.4077 29.5302 29.7131 35.8232 7.1761 59.0543 28.2338 50.5489 19.9110 31.6512 20.8137 40.8816 8.1975 35.5668
temp: 298.150 k
press: 1.00000 atm
elementType: 8 8 8 7 7 6 6 6 6 6 6 6 6 1 1 1 1 1 1 1 1 1 1 1 1 1 1
symmnumber: 1
zpe: 587451.7 jmol-1
zpe.correction: 0.223749 hartree
zpe.thermalcorrener: 0.237042 hartree
zpe.thermalcorrenthalpy: 0.237987 hartree
zpe.thermalcorrgfe: 0.183414 hartree
zpe.sumelectzpe: -647.444481 hartree
zpe.sumelectthermal: -647.431187 hartree
zpe.sumelectthermalent: -647.430243 hartree
zpe.sumelectthermalfe: -647.484815 hartree
dipole: -1.1904 4.5553 -1.6542
dipole: 4.9903
quadrupole: -61.7002 -78.1296 -83.0467
quadrupole: -11.3664 0.0390 2.0240
quadrupole: 12.5920 -3.8375 -8.7545 -11.3664 0.0390 2.0240
hfenergy: -647.6682294 hartree
pointgroup: C01 [X(C8H14N2O3)]
dipole: -0.4779215 -1.8092575 0.594081 debye
polarizability: 117.3778916|3.8140256|104.1922694|-8.7924363|1.5711525|92.6844067 unknown
InChI: InChI=1S/C8H14N2O3/c9-8(13)10-6-4-2-1-3-5(6)7(11)12/h5-6,10-11H,1-4,9H2
charge 0 multiplicity 1
27 atoms
O  2.806276 1.647325 0.544939
O  1.94138 1.316477 -1.575837
O  -2.118485 1.928222 0.611294
N  -1.659321 -0.313424 0.139151
N  -3.655958 0.288713 1.242051
C  -0.403608 -0.016048 -0.580994
C  0.690252 0.48557 0.412598
C  0.061559 -1.275842 -1.351322
C  1.195689 -0.655973 1.341215
C  0.571752 -2.402215 -0.416526
C  1.678658 -1.88333 0.532859
C  1.828931 1.157449 -0.337948
C  -2.45553 0.702684 0.657096
H  -0.607836 0.798021 -1.299919
H  0.233365 1.281038 1.034434
H  0.877513 -0.967373 -2.029117
H  -0.766657 -1.639866 -1.990276
H  0.354794 -0.953957 1.998109
H  2.000324 -0.272693 1.992328
H  0.952384 -3.242593 -1.027655
H  -0.261329 -2.816547 0.191759
H  1.996599 -2.68606 1.225268
H  2.571234 -1.606698 -0.065057
H  -1.930746 -1.291065 0.244393
H  3.510856 2.112367 0.016707
H  -4.004265 -0.666855 1.210816
H  -4.245635 1.018374 1.633732
