program: Gaussian 09
title: 000223764
version: EM64L-G09RevD.01
frameworkgroup: C1[X(C12H12N6O3)]
method: RPBEPBE
basis: SDD
operation: Freq
keyword: #p
keyword: freq=noraman
keyword: PBEPBE/SDD
title: #p freq=noraman PBEPBE/SDD
converged: YES YES NO NO
title: Mulliken charges:
elementType: O O O N N N N N N C C C C C C C C C C C C H H H H H H H H H H H H
charge: -0.228116 -0.228117 -0.228126 -0.221843 -0.221798 -0.221956 0.001982 0.001983 0.001993 0.245340 0.245154 0.245230 -0.342464 -0.342783 -0.342800 -0.414168 -0.413839 -0.414002 -0.141919 -0.142066 -0.141999 0.276423 0.276522 0.276527 0.276585 0.276510 0.276629 0.274870 0.273594 0.274621 0.273659 0.274585 0.273787
chargesum: 0.00000
title: Mulliken charges with hydrogens summed into heavy atoms:
elementType: O O O N N N N N N C C C C C C C C C C C C
charge: -0.228116 -0.228117 -0.228126 -0.221843 -0.221798 -0.221956 0.001982 0.001983 0.001993 0.245340 0.245154 0.245230 0.210481 0.210329 0.210338 0.134296 0.134441 0.134370 -0.141919 -0.142066 -0.141999
polarizability: 2.03592297e+02 -1.56345202e-02 2.03386214e+02 3.94800141e-02 -1.78246510e-02 1.01550696e+02
1716.lowfreq: -10.6291 -5.4801 -0.6689 -0.0009 -0.0006 -0.0003 14.2117 17.8111 21.6624
frequency: 14.1460 17.4545 21.2771 35.7584 50.6271 51.1315 55.3562 56.5810 58.3224 121.8293 122.2383 146.5779 154.2985 178.1503 178.5452 296.7166 308.5534 309.1972 348.7268 348.8428 353.6391 378.2006 378.4013 388.3423 423.1016 423.2231 465.0966 468.8206 468.9883 556.7792 556.9302 617.8716 701.8172 702.5082 703.5415 706.2783 739.3446 757.5331 758.2083 793.2316 928.6112 928.9313 948.2263 949.6758 949.7553 1022.5555 1022.7401 1033.1747 1036.0360 1046.3733 1046.9849 1136.4324 1138.3249 1139.6678 1230.6529 1243.7322 1246.1812 1247.7238 1286.2259 1287.0783 1289.9132 1320.0440 1320.7225 1340.9444 1364.3550 1365.0431 1374.8776 1401.2372 1401.6029 1442.6166 1446.2447 1446.6114 1451.9078 1452.5077 1452.6908 1614.2012 1614.2904 1674.7078 2207.6660 2207.7135 2207.7984 3005.9071 3006.1620 3006.6823 3060.3536 3060.5359 3060.9576 3066.4391 3066.7520 3067.2020 3133.5400 3133.6889 3134.0422
redmass: 5.6169 5.7136 2.7268 10.5003 4.8734 5.4454 5.6338 5.5054 5.0948 6.5662 6.5566 10.0425 8.4029 8.0736 8.0740 7.0867 2.4683 2.4744 8.4219 8.4077 3.3043 3.5976 3.5981 3.5205 12.3473 12.3895 6.8527 6.8514 6.8334 8.4656 8.4628 9.7442 11.2940 11.3436 2.0964 7.0868 12.0181 1.2265 1.2254 1.8457 4.1468 4.1619 4.5701 4.3177 4.3240 3.3885 3.3694 4.3373 2.3843 3.0670 3.0879 2.2052 2.0119 2.0340 10.8647 1.3984 1.5402 1.5080 1.3280 1.3299 1.3276 1.5727 1.5755 1.2320 1.4769 1.4388 1.2599 2.2961 2.2457 1.0950 1.1266 1.1265 1.0899 1.1100 1.1135 10.6477 10.6363 9.5462 12.4517 12.4525 12.4548 1.0581 1.0581 1.0582 1.0590 1.0590 1.0591 1.1026 1.1026 1.1027 1.1077 1.1078 1.1078
irintensity: 0.1088 0.0791 0.0254 3.7128 6.8820 5.9929 4.8410 4.1876 1.0933 0.1617 0.1657 27.9614 9.0871 0.3017 0.3144 3.6788 1.4556 1.3455 29.8727 29.9702 0.0276 4.9579 4.8395 0.0015 3.5871 3.5260 8.0577 0.0090 0.0040 40.6594 40.4006 1.1097 0.0170 0.0163 0.0012 5.1814 39.7772 10.7337 10.7650 0.0021 5.8780 5.9658 3.0218 0.1223 0.0891 3.2849 3.2842 1.4467 0.0026 0.0535 0.0451 0.0150 0.3468 0.3252 3.1017 2.4380 28.5225 24.8173 8.7076 7.0681 8.2532 151.5343 152.6305 0.5574 105.0981 91.9621 5.6294 206.0725 198.7472 6.9723 53.2596 55.6265 57.0094 89.3861 97.5139 620.3715 619.8790 0.0566 11.9634 12.3664 0.9957 1.8743 2.8976 3.6520 3.2193 5.1874 7.5717 1.0095 1.1336 1.2030 0.0163 0.0147 0.0141
temp: 298.150 k
press: 1.00000 atm
elementType: 8 8 8 7 7 7 7 7 7 6 6 6 6 6 6 6 6 6 6 6 6 1 1 1 1 1 1 1 1 1 1 1 1
symmnumber: 1
zpe: 629745.5 jmol-1
zpe.correction: 0.239857 hartree
zpe.thermalcorrener: 0.260915 hartree
zpe.thermalcorrenthalpy: 0.261859 hartree
zpe.thermalcorrgfe: 0.184120 hartree
zpe.sumelectzpe: -1017.147715 hartree
zpe.sumelectthermal: -1017.126658 hartree
zpe.sumelectthermalent: -1017.125714 hartree
zpe.sumelectthermalfe: -1017.203452 hartree
dipole: 0.0132 0.0058 -0.4484
dipole: 0.4487
quadrupole: -177.1392 -176.9271 -113.6112
quadrupole: 0.0350 0.0023 0.0046
quadrupole: -21.2467 -21.0346 42.2813 0.0350 0.0023 0.0046
hfenergy: -1017.3875728 hartree
pointgroup: C01 [X(C12H12N6O3)]
dipole: 0.0046304 -0.0027863 -0.1764352 debye
polarizability: 203.4477935|-0.0959488|203.5302844|-0.1975865|-0.0833019|101.5511289 unknown
InChI: InChI=1S/C12H12N6O3/c13-4-1-7-16-10(19)17(8-2-5-14)12(21)18(11(16)20)9-3-6-15/h1-3,7-9H2
charge 0 multiplicity 1
33 atoms
O  2.69142 0.233684 -0.543587
O  -1.143989 -2.449635 -0.534257
O  -1.550044 2.213653 -0.538947
N  0.789809 -1.130933 -0.602327
N  0.582296 1.249079 -0.60573
N  -1.375013 -0.1206 -0.600094
N  3.517914 -4.999989 0.754258
N  2.564131 5.546039 0.75122
N  -6.085109 -0.537753 0.771647
C  1.44011 0.124805 -0.581918
C  -0.612625 -1.311659 -0.576696
C  -0.830157 1.184438 -0.579401
C  1.641631 -2.347321 -0.629091
C  1.209755 2.595156 -0.631939
C  -2.854488 -0.250001 -0.622059
C  1.990558 -2.817937 0.810928
C  1.445777 3.1288 0.808836
C  -3.431522 -0.30678 0.820189
C  2.833023 -4.024176 0.785896
C  2.063315 4.464285 0.786927
C  -4.897448 -0.433543 0.801315
H  2.56167 -2.099111 -1.179802
H  1.083808 -3.13341 -1.160334
H  0.53332 3.268736 -1.179735
H  2.168264 2.506389 -1.165541
H  -3.101005 -1.174796 -1.165586
H  -3.258205 0.622317 -1.158098
H  2.531616 -2.015645 1.34567
H  1.061649 -3.042783 1.366756
H  0.481797 3.189805 1.346712
H  2.109778 2.437349 1.359629
H  -3.004852 -1.172532 1.359334
H  -3.159784 0.61417 1.368323
