program: Gaussian 09
title: 000217793
version: EM64L-G09RevD.01
frameworkgroup: C1[X(C23H25N3O3)]
method: RPBEPBE
basis: SDD
operation: Freq
keyword: #p
keyword: freq=noraman
keyword: PBEPBE/SDD
title: #p freq=noraman PBEPBE/SDD
converged: YES YES NO NO
title: Mulliken charges:
elementType: O O O N N N C C C C C C C C C C C C C C C C C C C C C C C H H H H H H H H H H H H H H H H H H H H H H H H H
charge: -0.243884 -0.253349 -0.355818 -0.124499 -0.227666 -0.470480 -0.288505 -0.436161 -0.559584 -0.402160 -0.381027 -0.383424 -0.408007 -0.392074 0.158546 0.159266 0.190146 0.436072 0.064130 0.302321 -0.349952 -0.358103 -0.307690 -0.343466 -0.275128 -0.224137 -0.225029 -0.238212 -0.249569 0.269307 0.234589 0.284897 0.272429 0.260701 0.192322 0.227611 0.210630 0.209910 0.209328 0.221101 0.210531 0.261859 0.265785 0.212475 0.378422 0.304714 0.245868 0.258178 0.311694 0.234312 0.234525 0.225774 0.223149 0.227333
chargesum: 0.00000
title: Mulliken charges with hydrogens summed into heavy atoms:
elementType: O O O N N N C C C C C C C C C C C C C C C C C C C C C C C
charge: -0.243884 -0.253349 -0.355818 -0.124499 -0.227666 -0.092058 -0.019198 0.083325 -0.026453 0.017773 0.039513 0.047006 0.064382 0.086185 0.158546 0.159266 0.190146 0.436072 0.064130 0.302321 -0.045238 -0.112235 -0.049512 -0.031772 -0.040817 0.010387 0.000744 -0.015063 -0.022236
polarizability: 3.89338590e+02 -2.74764880e+01 2.62727549e+02 -7.68688959e-01 2.97774154e+00 2.26543743e+02
1716.lowfreq: -17.3010 -2.9867 -0.0010 -0.0009 -0.0007 6.0935 8.7379 17.8085 26.2451
frequency: -8.3150 14.7106 26.1896 29.3724 53.4513 59.8857 62.0108 88.0762 95.8157 107.9768 113.1214 125.2677 168.8541 184.4778 191.7516 202.6680 229.3987 235.5885 276.1756 291.3696 297.0080 305.4542 327.6403 339.1804 376.8085 390.4198 400.7856 409.2594 414.1805 425.8637 442.7582 497.8907 506.7097 523.7567 533.8214 550.5058 576.9277 578.6193 610.4342 614.8640 619.0753 654.4972 680.9758 693.2999 696.5665 712.3313 722.6798 764.7870 767.0164 769.7253 779.0377 801.3014 816.2885 832.5873 840.2512 845.2885 876.3812 888.1492 896.4318 912.1190 916.8808 917.9840 922.3169 936.1568 948.3800 969.7577 973.8990 984.4132 995.4584 998.5126 1000.4733 1002.0481 1032.1966 1032.9458 1042.8658 1050.4398 1079.8517 1083.1554 1086.5021 1090.3670 1115.9751 1117.8712 1125.0652 1154.3840 1154.9235 1171.8699 1174.2474 1176.8841 1181.1160 1200.1205 1210.5417 1223.9068 1226.8283 1240.5552 1253.7522 1258.5758 1268.1055 1284.2572 1290.2500 1293.3052 1304.8600 1332.3959 1333.8266 1335.5929 1341.8297 1350.8329 1354.2929 1363.7090 1366.0429 1376.6494 1386.4439 1412.7246 1431.7668 1443.1795 1445.6547 1447.5866 1456.0575 1456.3530 1464.4384 1467.2382 1474.4175 1488.7446 1495.7540 1501.6493 1554.5943 1584.7587 1585.7871 1613.2839 1614.6892 1625.4376 1632.8475 2969.8653 2970.6367 2973.8610 2985.8955 2990.2924 2992.5271 3008.6861 3017.0797 3041.2096 3048.9963 3059.1240 3062.1005 3100.6248 3101.6111 3106.3859 3126.6999 3133.6864 3137.0421 3144.3853 3155.6241 3165.3483 3167.9855 3191.9402 3192.7911 3196.9910
redmass: 4.4558 5.1833 5.0107 4.6438 4.1902 4.8626 4.9494 4.6275 3.6107 6.9749 4.7496 5.6969 4.7306 3.5851 3.7437 2.9976 4.9869 3.5790 3.2004 5.5083 4.7526 3.4645 3.7248 4.0643 3.2017 5.2350 4.8779 2.9502 2.7249 3.7393 3.0632 2.9211 2.7694 4.1532 3.4620 3.9468 2.6581 4.3690 4.5114 5.9111 4.4863 6.7655 4.6329 6.2693 1.9691 5.6141 6.2703 3.0712 1.8684 3.8859 1.6642 1.4964 3.6386 4.0459 1.2661 1.5097 2.8558 2.5197 1.3557 1.4381 1.4691 2.3539 2.9195 2.2002 1.3329 1.3533 1.3554 5.9027 2.6779 1.3382 1.4928 2.2607 2.2356 2.3502 2.1833 1.8379 2.4464 2.3766 2.9503 1.4748 2.6429 2.8393 1.8721 1.2762 1.2821 1.9992 1.0543 1.1590 1.8103 1.1397 4.6634 2.2283 1.2475 1.6456 1.3078 1.4071 1.6094 1.2132 1.5426 1.4779 2.2060 1.2693 1.3652 1.3848 1.4585 1.9986 1.5248 1.4725 2.2810 4.0069 4.7047 2.7418 2.2621 1.3057 2.1032 2.3239 1.1323 1.1754 1.0856 1.1197 1.1327 1.8624 1.2676 2.9288 3.7030 5.7341 6.1983 6.2308 6.5337 2.6956 10.6336 1.0694 1.0647 1.0693 1.0608 1.0595 1.0609 1.0688 1.0819 1.0961 1.1024 1.1031 1.1046 1.0986 1.0945 1.0938 1.0848 1.0857 1.0900 1.0914 1.0940 1.0986 1.0986 1.0953 1.0949 1.0822
irintensity: 0.3964 0.6528 0.4879 0.1039 0.5867 0.4937 0.2530 3.6075 3.9297 6.4576 3.4043 1.6885 0.2317 2.1000 2.3217 4.7201 7.7206 1.9686 6.3748 0.8656 5.0642 7.7331 1.0777 5.0242 3.2699 9.3976 11.4333 0.1542 4.8661 6.4453 0.4146 10.8352 5.3297 4.9097 6.9943 10.0121 1.1477 6.5913 2.0393 7.5066 15.0231 10.8443 14.8584 8.1083 39.7608 8.5658 0.8322 20.7285 54.9347 21.5005 61.1243 1.5054 4.9008 6.6650 0.8830 18.7450 14.0780 16.6504 0.2549 3.0678 57.3725 15.0499 5.6456 7.6185 8.5362 5.8203 0.5679 0.9370 84.6945 1.7765 10.8895 11.1432 5.1523 6.7981 19.0993 10.0220 18.9973 3.7054 3.4696 1.5721 18.5609 52.8754 12.7479 0.1425 10.3739 0.3400 0.6318 8.3220 40.6693 0.5084 112.9842 12.0842 21.0653 144.1926 1.6071 26.9404 123.4209 30.7986 30.4896 23.7641 240.9811 0.7006 2.8689 4.7203 11.3686 59.5099 13.1815 21.2132 116.8251 92.1434 13.8580 100.0569 210.9953 14.5591 169.4601 4.9183 1.8839 24.6557 14.4725 4.6807 3.1811 308.4886 5.4238 578.7803 71.9407 360.3595 2.0604 79.1388 90.9607 0.4608 255.6603 17.1684 28.3032 83.4199 23.3953 16.8850 27.1914 4.5796 13.9110 52.3931 33.2538 81.3899 16.9023 8.0233 4.0166 10.5220 1.5015 0.2068 17.8662 17.4031 45.3672 22.1231 11.9127 8.2315 10.1841 376.8136
temp: 298.150 k
press: 1.00000 atm
elementType: 8 8 8 7 7 7 6 6 6 6 6 6 6 6 6 6 6 6 6 6 6 6 6 6 6 6 6 6 6 1 1 1 1 1 1 1 1 1 1 1 1 1 1 1 1 1 1 1 1 1 1 1 1 1
symmnumber: 1
zpe: 1157505.5 jmol-1
zpe.correction: 0.440871 hartree
zpe.thermalcorrener: 0.465131 hartree
zpe.thermalcorrenthalpy: 0.466075 hartree
zpe.thermalcorrgfe: 0.384957 hartree
zpe.sumelectzpe: -1279.338097 hartree
zpe.sumelectthermal: -1279.313837 hartree
zpe.sumelectthermalent: -1279.312893 hartree
zpe.sumelectthermalfe: -1279.394011 hartree
dipole: 8.3870 3.6414 -3.1529
dipole: 9.6718
quadrupole: -151.6140 -165.0724 -177.7262
quadrupole: -3.2009 7.5497 -0.8171
quadrupole: 13.1902 -0.2682 -12.9220 -3.2009 7.5497 -0.8171
hfenergy: -1279.7789678 hartree
pointgroup: C01 [X(C23H25N3O3)]
dipole: -2.5206432 2.5679238 1.2374875 debye
polarizability: 391.0598408|-19.6605764|259.0066302|-14.4063688|-3.7889945|228.5434114 unknown
InChI: InChI=1S/C23H25N3O3/c27-21-15-17(16-26(21)18-9-3-1-4-10-18)22(28)24-20-12-6-5-11-19(20)23(29)25-13-7-2-8-14-25/h1,3-6,9-12,17,24H,2,7-8,13-16H2
charge 0 multiplicity 1
54 atoms
O  3.990773 -2.602376 -2.533434
O  0.219558 -2.370933 1.25533
O  -1.969758 1.160286 -1.52792
N  -3.561511 2.462956 -0.449868
N  3.767115 -1.403877 -0.480298
N  -0.994452 -0.770572 0.021562
C  1.385872 -1.083561 -0.469267
C  2.659854 -0.972279 0.411049
C  1.766412 -2.170924 -1.510256
C  -3.235084 5.230385 0.492477
C  -3.474306 4.058059 1.470495
C  -2.528278 4.724428 -0.786606
C  -4.246393 2.895435 0.79609
C  -3.322332 3.562626 -1.423021
C  3.294955 -2.097316 -1.610252
C  0.154427 -1.470074 0.361562
C  -2.902257 1.257738 -0.637162
C  5.130962 -1.20378 -0.107758
C  -3.293965 0.055491 0.177185
C  -2.307616 -0.932148 0.527511
C  6.197301 -1.488372 -1.008098
C  5.435707 -0.704854 1.190096
C  -4.647162 -0.177546 0.536859
C  -2.681751 -2.042494 1.332546
C  -5.022633 -1.305518 1.291888
C  -4.026577 -2.218453 1.711712
C  7.530345 -1.266217 -0.606784
C  6.775612 -0.486852 1.573737
C  7.833735 -0.762754 0.679545
H  1.216711 -0.125786 -0.994543
H  2.82709 0.061462 0.759887
H  2.572594 -1.64314 1.287075
H  1.491691 -3.180238 -1.148588
H  1.307685 -2.024031 -2.500181
H  -4.20897 5.687127 0.218743
H  -2.636142 6.021479 0.980642
H  -2.501903 3.674742 1.837487
H  -4.049717 4.394682 2.354052
H  -2.426243 5.54002 -1.527192
H  -1.507847 4.372026 -0.5419
H  -5.274472 3.227648 0.54278
H  -4.321504 2.046537 1.49015
H  -2.783083 3.136334 -2.282485
H  -4.313037 3.929635 -1.761934
H  -0.957244 -0.073785 -0.752114
H  5.969348 -1.887928 -1.997624
H  4.638245 -0.500483 1.910408
H  -5.415297 0.522964 0.192046
H  -1.910525 -2.754159 1.632369
H  -6.07391 -1.470998 1.548061
H  -4.300243 -3.08894 2.317987
H  8.339122 -1.490578 -1.311458
H  6.989254 -0.104761 2.57839
H  8.873148 -0.592934 0.980021
