program: Gaussian 09
title: 000217789
version: EM64L-G09RevD.01
frameworkgroup: C1[X(C16H20N2O2)]
method: RPBEPBE
basis: SDD
operation: Freq
keyword: #p
keyword: freq=noraman
keyword: PBEPBE/SDD
title: #p freq=noraman PBEPBE/SDD
converged: YES YES NO NO
title: Mulliken charges:
elementType: O O N N C C C C C C C C C C C C C C C C H H H H H H H H H H H H H H H H H H H H
charge: -0.289323 -0.244805 -0.122969 -0.222347 -0.255297 -0.454143 -0.550298 -0.396167 -0.386654 0.215649 -0.377657 -0.372662 -0.405786 0.147981 0.435183 -0.349587 -0.353996 -0.225954 -0.241253 -0.248690 0.254237 0.294027 0.231881 0.264255 0.246301 0.209843 0.271483 0.227274 0.214150 0.207480 0.213413 0.205670 0.206355 0.226462 0.193895 0.304488 0.250142 0.225654 0.224095 0.227673
chargesum: 0.00000
title: Mulliken charges with hydrogens summed into heavy atoms:
elementType: O O N N C C C C C C C C C C C C C C C C
charge: -0.289323 -0.244805 -0.122969 -0.222347 -0.001060 0.071765 -0.039742 0.085158 0.054770 0.215649 0.043235 0.039363 0.014570 0.147981 0.435183 -0.045099 -0.103854 -0.000300 -0.017158 -0.021017
polarizability: 2.72802754e+02 1.42428588e+01 1.83015634e+02 -6.49634315e+00 -2.10978346e+00 1.21388384e+02
1716.lowfreq: -24.0202 -6.5375 -4.8406 0.0003 0.0005 0.0006 19.6627 28.6938 50.6457
frequency: 14.8977 27.0214 50.5405 61.8254 64.6669 108.5298 113.3791 140.0868 181.0508 190.5462 231.3449 266.1562 281.3384 298.0308 337.6450 359.1712 390.4968 396.5815 409.8534 423.3005 445.1378 496.0779 511.4465 533.7695 565.0498 601.8135 614.4918 632.6330 654.5243 697.3189 701.8774 719.7326 767.2513 785.1786 801.1242 831.0581 842.1277 844.0954 875.3028 911.2584 914.0315 922.8538 939.3005 947.5383 974.0468 979.6766 984.5143 998.3400 1017.3369 1031.8486 1042.7119 1053.5862 1079.8955 1088.3559 1098.6590 1115.3391 1121.9324 1136.1613 1151.7319 1155.2476 1174.1579 1199.7108 1204.0462 1215.6617 1223.9987 1236.0449 1255.1181 1257.4569 1274.4686 1283.4004 1297.5498 1326.3472 1330.9405 1336.2485 1338.6314 1344.0882 1347.2857 1357.3995 1367.3431 1386.1573 1423.3736 1446.9542 1448.8101 1455.9240 1461.3164 1464.5029 1470.9784 1481.2107 1490.3739 1501.3652 1573.1257 1585.7347 1613.4799 1629.7815 2955.6786 2961.5858 2972.1893 2985.8598 2989.6457 2999.1880 3005.8584 3021.6740 3041.0598 3048.5769 3057.6484 3066.2569 3088.1415 3092.1137 3096.8335 3126.9968 3137.4638 3156.7369 3169.3720 3192.4833
redmass: 4.3467 4.1557 3.6389 4.8325 4.9334 3.6643 4.7724 3.9420 3.4386 2.8922 3.7309 2.5044 3.4610 3.2232 5.4562 4.0764 4.2779 1.8942 2.9452 3.3301 3.3166 2.6275 2.7483 3.4618 3.1103 2.9747 6.1890 3.9475 6.7519 1.9634 5.8684 5.0853 1.7388 4.3544 1.5174 2.7626 1.2640 1.4933 2.6735 2.3424 1.4316 3.9602 2.0228 1.3324 1.4292 2.2566 5.7604 1.3148 2.3781 2.2259 1.9002 1.9130 2.1520 1.4914 3.2173 2.6645 2.3616 2.0948 1.3551 1.2859 1.0524 1.1423 1.4039 2.8852 1.5664 2.2705 1.3369 1.3196 1.2109 1.5173 1.5261 1.3692 1.3853 1.4160 1.4320 1.4483 1.4497 1.4001 2.5236 4.7361 3.0082 2.0787 1.1863 1.0895 1.0866 1.0942 1.0837 1.0963 2.2425 1.1231 7.3858 6.1927 5.9642 10.5185 1.0712 1.0696 1.0638 1.0609 1.0611 1.0582 1.0656 1.0838 1.0963 1.1024 1.1032 1.1057 1.0988 1.0934 1.0907 1.0849 1.0901 1.0945 1.0979 1.0950
irintensity: 1.3326 0.5415 1.0759 1.8469 0.7143 0.4984 6.1782 0.5392 0.5807 2.4614 3.7279 4.7382 4.1727 1.7202 0.2322 16.5468 8.8704 3.0553 0.2490 3.8388 0.9798 3.1962 10.4436 9.1499 2.0652 0.8461 0.2987 9.7586 9.1757 42.3926 3.3420 4.9144 75.1406 2.5790 0.3415 1.8001 0.6587 18.5879 3.9152 4.3028 7.8728 1.0945 2.3671 6.5107 0.6238 3.7397 0.8959 2.3205 41.4048 2.7995 6.8677 15.0653 15.4554 1.1456 14.7305 60.6181 7.8627 10.3247 8.5261 0.0235 0.6934 1.7735 17.8783 95.0839 105.9133 59.0605 11.1087 18.6431 12.5901 105.1476 54.4266 22.4044 13.3496 11.0950 22.1981 4.5328 6.6339 8.7447 114.2721 8.2979 125.9567 11.2995 8.4713 8.9120 12.7646 20.2579 12.0915 7.1300 160.5293 4.2323 266.4477 1.3505 103.0710 264.1189 24.6769 52.6995 42.5884 28.0578 30.5159 19.4122 5.3147 14.4653 57.5894 32.9788 78.9244 17.5084 16.1250 8.8616 27.3303 0.9863 18.8019 41.0592 9.9710 8.9497
temp: 298.150 k
press: 1.00000 atm
elementType: 8 8 7 7 6 6 6 6 6 6 6 6 6 6 6 6 6 6 6 6 1 1 1 1 1 1 1 1 1 1 1 1 1 1 1 1 1 1 1 1
symmnumber: 1
zpe: 878652.3 jmol-1
zpe.correction: 0.334661 hartree
zpe.thermalcorrener: 0.352330 hartree
zpe.thermalcorrenthalpy: 0.353274 hartree
zpe.thermalcorrgfe: 0.286849 hartree
zpe.sumelectzpe: -880.201934 hartree
zpe.sumelectthermal: -880.184265 hartree
zpe.sumelectthermalent: -880.183321 hartree
zpe.sumelectthermalfe: -880.249746 hartree
dipole: 5.1323 -0.7421 2.9855
dipole: 5.9837
quadrupole: -99.7899 -125.1321 -123.5779
quadrupole: 12.5709 0.7767 -1.9249
quadrupole: 16.3767 -8.9655 -7.4113 12.5709 0.7767 -1.9249
hfenergy: -880.5365951 hartree
pointgroup: C01[X(C16H20N2O2)]
dipole: 2.0437658 0.3719381 -1.107621 debye
polarizability: 273.1244719|-11.1004918|182.1632711|11.2525238|-1.7125269|121.9190289 unknown
InChI: InChI=1S/C16H20N2O2/c19-15-11-13(16(20)17-9-5-2-6-10-17)12-18(15)14-7-3-1-4-8-14/h1,3-4,7-8,13H,2,5-6,9-12H2
charge 0 multiplicity 1
40 atoms
O  1.614084 1.475416 1.54393
O  -1.858408 -2.679862 0.505276
N  3.185668 0.160353 0.44457
N  -1.651341 -0.353976 0.001273
C  0.743331 -0.169513 -0.044296
C  -0.565274 0.661196 -0.032859
C  0.32966 -1.506802 0.62994
C  4.297677 0.828893 1.166216
C  3.623858 -0.904829 -0.485122
C  1.879207 0.557415 0.699034
C  5.315961 1.422921 0.168615
C  4.632289 -0.351458 -1.52181
C  5.821984 0.34154 -0.815642
C  -1.179159 -1.62407 0.372389
C  -3.011052 0.021024 -0.222975
C  -4.046885 -0.952143 -0.316718
C  -3.341485 1.398783 -0.360847
C  -5.374891 -0.540464 -0.550676
C  -4.675441 1.792005 -0.59671
C  -5.702766 0.827578 -0.696311
H  1.022789 -0.368384 -1.09411
H  -0.589325 1.313865 0.859189
H  -0.656452 1.288834 -0.936301
H  0.489067 -1.472747 1.724851
H  0.852405 -2.39623 0.242884
H  4.800443 0.080648 1.814775
H  3.852151 1.603352 1.809962
H  2.755854 -1.356345 -0.988272
H  4.115199 -1.707548 0.105599
H  6.161459 1.860888 0.73215
H  4.832454 2.245935 -0.392632
H  4.113862 0.374568 -2.178544
H  4.987357 -1.182914 -2.160413
H  6.505609 0.7853 -1.563021
H  6.406476 -0.417892 -0.255833
H  -3.801481 -2.008365 -0.194443
H  -2.570582 2.169225 -0.269034
H  -6.160267 -1.301732 -0.6195
H  -4.908993 2.857922 -0.697532
H  -6.737742 1.135614 -0.879253
