program: Gaussian 09
title: 000223786
version: EM64L-G09RevD.01
frameworkgroup: C1[X(C19H17NO5)]
method: RPBEPBE
basis: SDD
operation: Freq
keyword: #p
keyword: freq=noraman
keyword: PBEPBE/SDD
title: #p freq=noraman PBEPBE/SDD
converged: YES YES NO NO
title: Mulliken charges:
elementType: O O O O O N C C C C C C C C C C C C C C C C C C C H H H H H H H H H H H H H H H H H
charge: -0.242548 -0.183835 -0.228162 -0.241521 -0.226998 -0.240004 -0.362255 -0.532491 0.202397 0.184521 0.124411 0.093593 0.096686 -0.356789 -0.353839 0.375582 -0.210154 -0.210580 -0.480952 -0.405135 0.182836 0.198657 -0.333288 -0.549660 -0.537703 0.244453 0.271029 0.257588 0.242028 0.264893 0.271515 0.238951 0.239712 0.270916 0.277971 0.246508 0.222131 0.247194 0.242366 0.225228 0.250132 0.224618
chargesum: 0.00000
title: Mulliken charges with hydrogens summed into heavy atoms:
elementType: O O O O O N C C C C C C C C C C C C C C C C C C C
charge: -0.242548 -0.183835 -0.228162 -0.241521 -0.226998 -0.240004 0.153227 -0.032875 0.202397 0.184521 0.124411 0.093593 0.096686 -0.091897 -0.082324 0.375582 0.028797 0.029132 -0.210037 -0.127164 0.182836 0.198657 -0.086781 0.162030 0.162275
polarizability: 2.25887445e+02 3.31361771e+01 2.59336220e+02 -1.12810399e+01 -7.49947496e+00 2.10249059e+02
1716.lowfreq: -6.6872 -0.0003 -0.0002 0.0002 2.7770 8.6812 11.8444 21.7906 38.9921
frequency: 8.4673 21.7483 38.9725 45.5208 72.9904 78.9453 98.1384 106.6478 135.8495 141.5480 171.7457 174.7679 176.3090 182.0010 230.1292 236.8545 239.3925 263.7321 267.2134 286.3371 322.5146 328.6930 340.3694 374.8864 377.3554 411.8201 440.3874 454.5305 461.8603 480.9416 495.4215 524.3761 541.0744 580.9410 588.9765 606.1377 648.4637 658.6230 680.0230 691.8349 710.7328 720.3256 737.0625 750.8692 785.5562 794.5477 824.6273 848.7871 856.9523 864.4419 877.4938 905.7468 924.3984 965.1351 973.7536 978.1502 983.3506 986.0097 1002.8554 1006.3256 1021.9943 1041.9554 1072.9783 1099.2175 1110.3938 1111.8746 1128.4263 1148.6106 1160.5801 1167.1637 1171.2350 1191.6222 1196.9263 1215.2016 1251.7347 1263.1233 1273.6487 1283.0990 1296.0614 1334.5261 1343.5244 1366.9939 1382.4246 1417.4002 1417.9515 1437.6523 1444.5134 1454.0832 1454.2025 1464.8199 1468.8418 1469.8323 1470.8592 1472.3614 1475.0188 1512.0745 1548.9950 1587.2513 1605.5028 1614.4379 1617.4056 1623.0694 1677.2214 2963.8060 2965.5498 3004.3233 3018.2880 3054.1868 3056.7935 3076.4715 3113.3281 3128.9310 3131.2969 3139.8061 3152.2470 3152.9122 3164.4411 3171.1292 3174.7435 3182.7087
redmass: 6.3700 5.4258 5.7355 6.9980 4.8847 5.2053 3.8432 5.2420 4.5019 5.2244 6.7805 3.3296 3.3023 3.8285 1.8734 2.1659 3.0242 2.3427 1.7724 2.8971 6.1052 7.8690 5.2852 3.7227 4.1990 3.1894 4.0399 4.7976 3.2459 5.1796 5.0981 7.2433 4.3464 8.5352 4.6415 4.3757 5.0537 4.7879 5.7088 6.0301 3.0702 3.2887 5.1161 2.9514 5.2822 1.6313 1.4954 4.9264 5.0257 2.0871 2.5030 1.3965 3.6231 1.4099 1.4144 7.4606 3.4465 4.0422 3.0627 1.3489 2.2244 2.6072 2.6286 2.2456 1.2662 1.2592 1.7626 1.5723 1.3822 1.2373 2.0056 1.7476 2.0721 2.0209 2.0888 1.8637 2.0210 1.4977 1.5602 3.6782 1.4930 1.5653 3.8233 6.0603 4.3995 1.2238 1.2820 2.5884 2.4598 1.1733 1.0500 1.0527 1.0748 1.1339 1.0713 2.6013 8.2352 6.5678 6.9979 9.3294 7.8968 8.9925 11.8641 1.0328 1.0327 1.0615 1.0660 1.1039 1.1042 1.1022 1.0953 1.1002 1.0999 1.0864 1.0871 1.0906 1.0956 1.0956 1.1004 1.0897
irintensity: 0.3371 0.3084 1.6884 1.6864 1.1633 1.7546 6.6631 9.9947 2.6140 1.4659 3.3834 2.6938 0.8810 8.5453 2.6274 1.3951 1.2552 2.5460 1.8817 4.5300 0.8241 13.8520 4.8409 6.8058 7.9230 1.3702 3.5929 0.5120 3.6442 4.8647 4.8660 9.6627 14.0103 6.8300 10.5428 2.7486 2.4653 0.0763 2.0054 4.3478 94.3668 7.6376 18.8465 6.3491 0.2371 26.4057 40.3714 22.2209 14.4870 40.8018 4.8902 0.1289 3.2394 1.4340 2.2486 27.1992 44.8825 61.9419 9.9070 0.0193 5.3744 27.4184 11.1630 17.5788 1.3651 0.1564 170.2095 24.1893 4.8518 5.6376 6.1112 95.7349 35.9835 36.4691 10.5589 180.5767 225.0447 1.1853 50.4192 244.1874 90.5822 54.1192 26.5275 7.6306 9.1653 12.6636 7.0093 7.5248 5.8980 27.4740 11.3660 18.7686 81.8746 16.2370 50.6973 60.2454 224.0266 37.4130 101.6868 260.0184 30.5902 152.4452 75.2574 68.3461 49.5531 20.8011 31.0081 32.0353 46.2665 3.6222 4.6536 21.6610 21.6116 1.3994 3.6051 5.2203 6.2304 10.6846 18.9992 3.6425
temp: 298.150 k
press: 1.00000 atm
elementType: 8 8 8 8 8 7 6 6 6 6 6 6 6 6 6 6 6 6 6 6 6 6 6 6 6 1 1 1 1 1 1 1 1 1 1 1 1 1 1 1 1 1
symmnumber: 1
zpe: 843375.9 jmol-1
zpe.correction: 0.321225 hartree
zpe.thermalcorrener: 0.343758 hartree
zpe.thermalcorrenthalpy: 0.344703 hartree
zpe.thermalcorrgfe: 0.267249 hartree
zpe.sumelectzpe: -1163.310239 hartree
zpe.sumelectthermal: -1163.287705 hartree
zpe.sumelectthermalent: -1163.286761 hartree
zpe.sumelectthermalfe: -1163.364215 hartree
dipole: -0.6300 -4.8145 0.3848
dipole: 4.8708
quadrupole: -130.9651 -143.7808 -136.4248
quadrupole: -11.3556 10.5865 14.8784
quadrupole: 6.0918 -6.7239 0.6321 -11.3556 10.5865 14.8784
hfenergy: -1163.6314635 hartree
pointgroup: C01 [X(C19H17N1O5)]
dipole: 0.0112684 1.9116478 -0.1329995 debye
polarizability: 214.0755454|-25.9660872|267.002474|10.8351647|-13.8035048|214.3947041 unknown
InChI: InChI=1S/C19H17NO5/c1-24-16-8-7-12(11-17(16)25-2)15(21)9-10-20-18(22)13-5-3-4-6-14(13)19(20)23/h3-8,11H,9-10H2,1-2H3
charge 0 multiplicity 1
42 atoms
O  1.614291 0.024488 -1.991253
O  2.800805 -2.188176 2.000349
O  -0.873938 -3.368871 0.819443
O  -2.462138 1.845258 -2.044607
O  -4.374192 1.970174 -0.218482
N  2.06244 -1.391329 -0.124656
C  1.67577 -2.699757 -0.686198
C  0.227225 -2.744966 -1.234367
C  2.540309 0.872681 0.155816
C  2.890185 0.214766 1.358853
C  2.018116 -0.148218 -0.808853
C  2.607286 -1.246432 1.197462
C  -0.818244 -2.5234 -0.128568
C  2.700621 2.258075 0.006685
C  3.412414 0.917295 2.454439
C  -1.743466 -1.353489 -0.174009
C  3.227414 2.980193 1.109437
C  3.577728 2.320242 2.314716
C  -1.635375 -0.319338 -1.15048
C  -2.762127 -1.262715 0.808205
C  -2.513864 0.77959 -1.142595
C  -3.545622 0.854582 -0.147438
C  -3.655129 -0.17559 0.818714
C  -1.42549 1.789975 -3.084565
C  -5.44222 2.088808 0.780663
H  2.378822 -2.965907 -1.497382
H  1.788492 -3.428932 0.13522
H  0.123655 -2.055153 -2.083272
H  0.071939 -3.773112 -1.613904
H  2.42879 2.75822 -0.92812
H  3.678631 0.39601 3.379134
H  3.366056 4.063772 1.030966
H  3.981529 2.904074 3.148707
H  -0.845831 -0.355678 -1.903706
H  -2.831849 -2.059989 1.554599
H  -4.437101 -0.130072 1.582431
H  -1.578966 0.921192 -3.753984
H  -0.409995 1.739095 -2.647613
H  -1.548825 2.723545 -3.652307
H  -6.152908 1.243152 0.71029
H  -5.955324 3.028904 0.532775
H  -5.028012 2.145534 1.805559
