program: Gaussian 09
title: 000223750
version: EM64L-G09RevD.01
frameworkgroup: C1[X(C17H20N4OS)]
method: RPBEPBE
basis: SDD
operation: Freq
keyword: #p
keyword: freq=noraman
keyword: PBEPBE/SDD
title: #p freq=noraman PBEPBE/SDD
converged: YES YES NO NO
title: Mulliken charges:
elementType: S O N N N N C C C C C C C C C C C C C C C C C H H H H H H H H H H H H H H H H H H H H
charge: 0.263101 -0.245823 -0.282889 -0.002743 0.001258 -0.020581 -0.000937 0.164634 0.171082 0.409862 -0.413414 -0.234799 -0.390846 -0.385565 -0.605863 -0.348711 -0.356582 -0.402066 -0.678249 -0.227461 -0.204246 -0.673375 -0.249725 0.281367 0.226039 0.226719 0.217021 0.216993 0.267355 0.266705 0.216192 0.215981 0.304991 0.288555 0.213702 0.226850 0.213758 0.224407 0.228706 0.212667 0.224343 0.212668 0.228917
chargesum: 0.00000
title: Mulliken charges with hydrogens summed into heavy atoms:
elementType: S O N N N N C C C C C C C C C C C C C C C C C
charge: 0.263101 -0.245823 -0.282889 -0.002743 0.001258 -0.020581 -0.000937 0.164634 0.171082 0.409862 -0.132047 0.217959 -0.390846 0.048449 -0.071802 0.083462 -0.051591 -0.113510 -0.023938 -0.003055 0.024460 -0.023697 -0.020807
polarizability: 3.54548229e+02 -5.00034071e+00 2.94188256e+02 2.78691572e-01 4.24387532e-01 1.14443963e+02
1716.lowfreq: -3.9143 -0.0020 0.0003 0.0008 1.1321 2.9066 26.1101 26.9939 38.5700
frequency: 26.0234 26.9858 38.5697 48.5994 53.3852 58.9871 63.2030 74.6259 111.1884 113.3353 119.2899 137.4242 196.2639 198.1721 202.2767 214.1832 221.9771 226.1871 230.2547 274.1403 282.6777 312.7673 356.0860 359.2480 381.9752 410.0031 415.1807 444.2626 512.9240 555.0366 604.4884 615.4268 624.0707 662.5360 665.1903 671.2405 700.2307 701.4663 719.1389 748.4672 759.2694 765.2978 771.2295 781.0256 851.5297 856.1671 860.2386 875.3583 880.5508 888.1587 902.7449 927.3947 938.1684 966.7984 987.3783 990.9535 1000.6689 1016.8248 1032.9921 1050.5218 1050.7400 1061.7484 1078.5140 1094.9626 1107.8179 1130.5502 1140.7916 1149.6374 1171.8140 1188.6219 1216.6748 1216.7519 1225.9922 1252.5350 1271.9485 1279.2329 1285.5988 1292.1655 1301.6559 1322.2447 1334.7869 1339.7568 1345.0800 1381.4651 1387.3386 1390.5007 1396.9918 1400.7689 1425.3835 1445.9755 1449.4464 1469.3837 1474.7397 1477.6967 1477.9359 1480.1598 1485.5128 1490.4130 1491.9481 1514.0297 1578.8923 1596.3354 1613.7406 2978.4513 2981.8271 2990.0637 3001.6726 3010.6300 3030.3304 3037.8329 3047.3241 3071.5212 3076.3782 3080.4827 3086.2671 3090.4942 3108.6308 3129.1585 3141.0134 3160.9999 3178.3118 3189.3153 3234.6571
redmass: 4.2963 4.3577 3.4532 3.9684 1.7332 4.1417 2.3851 2.1187 3.5643 5.1507 4.9479 3.7137 4.2422 4.1771 4.1543 1.4439 1.1183 3.7869 4.2899 4.7712 7.6616 4.3125 6.7409 5.6151 5.5832 2.9641 6.2606 6.5238 3.2978 10.3686 7.1548 6.6167 7.8824 9.1593 10.1354 7.5287 5.9883 2.0725 8.4655 1.0824 1.0767 9.7433 1.6943 4.8753 1.4490 1.2285 1.2027 3.9076 1.1518 6.1534 1.9051 2.5815 1.4106 6.4559 6.2323 1.3540 1.2994 4.2109 2.5160 2.8570 2.8524 1.1839 4.3282 1.7427 2.1899 2.4576 1.4407 2.6118 1.0533 1.1457 1.4485 2.1361 1.2691 1.3142 4.1949 1.1014 1.1011 3.6661 1.8600 1.5235 2.0534 2.7190 2.5465 2.7107 5.1064 1.2025 1.2555 6.0405 4.6865 1.1746 2.1396 1.0989 1.0506 1.0418 1.0599 1.0408 1.0850 1.1734 2.4239 7.0096 9.6919 6.9630 6.0386 1.0353 1.0361 1.0600 1.0607 1.0568 1.0569 1.1017 1.1015 1.1037 1.1014 1.0993 1.0990 1.1062 1.1084 1.0854 1.0908 1.0969 1.0959 1.0953 1.0981
irintensity: 0.0033 0.9674 0.0134 0.2543 0.0266 0.6214 0.3685 0.0134 2.0740 0.8804 0.1155 0.1293 3.5604 0.5397 0.0770 0.0165 0.0003 0.0248 0.4181 1.7113 5.4322 5.9179 0.0186 9.5587 3.6223 0.0009 7.0161 0.7900 6.2794 0.3469 0.2378 0.6714 1.7736 8.3020 1.5290 24.7641 12.8617 35.8856 5.0965 10.0864 5.6507 5.5795 54.1827 30.0023 14.9137 1.4246 0.0006 29.0082 2.1853 36.0943 17.7016 27.2025 8.5218 185.1262 0.8219 0.0935 1.9487 11.0215 9.9045 5.9359 9.2816 1.6399 131.7170 18.1495 14.3523 40.5502 0.3782 148.8246 0.2388 7.5267 7.1126 62.4122 0.4502 6.8881 64.3991 0.0046 0.0894 15.4285 103.7228 27.0339 97.7197 411.2315 111.3302 35.7687 34.6223 14.3775 17.5597 80.2066 12.4192 36.8670 30.1963 16.0443 4.4324 13.9939 0.9275 13.3826 13.4039 84.6371 181.7169 254.5443 358.5913 11.7587 28.4294 31.7077 34.1163 21.3847 6.4729 31.9324 14.6634 3.4745 0.0300 5.0495 43.8375 52.3412 42.5558 81.5280 29.2594 0.2245 23.7050 26.5945 17.2174 4.5418 1.6363
temp: 298.150 k
press: 1.00000 atm
elementType: 16 8 7 7 7 7 6 6 6 6 6 6 6 6 6 6 6 6 6 6 6 6 6 1 1 1 1 1 1 1 1 1 1 1 1 1 1 1 1 1 1 1 1
symmnumber: 1
zpe: 899558.3 jmol-1
zpe.correction: 0.342624 hartree
zpe.thermalcorrener: 0.365221 hartree
zpe.thermalcorrenthalpy: 0.366165 hartree
zpe.thermalcorrgfe: 0.287921 hartree
zpe.sumelectzpe: -1350.412232 hartree
zpe.sumelectthermal: -1350.389636 hartree
zpe.sumelectthermalent: -1350.388691 hartree
zpe.sumelectthermalfe: -1350.466935 hartree
dipole: -0.5451 1.1628 0.0032
dipole: 1.2842
quadrupole: -117.0932 -138.5324 -147.0159
quadrupole: 8.6086 0.0215 0.0681
quadrupole: 17.1207 -4.3186 -12.8021 8.6086 0.0215 0.0681
hfenergy: -1350.7548561 hartree
pointgroup: C01 [X(C17H20N4O1S1)]
dipole: -0.2397869 0.4443775 0.0170573 debye
polarizability: 354.9084825|-1.6480749|293.5192013|1.5109053|7.3270882|114.7527648 unknown
InChI: InChI=1S/C17H20N4OS/c1-3-10-22-16-14-12-18-21(13-8-6-5-7-9-13)15(14)19-17(20-16)23-11-4-2/h5-9,12H,3-4,10-11H2,1-2H3
charge 0 multiplicity 1
43 atoms
S  -0.997265 3.248047 0.17188
O  -3.560354 -1.081071 -0.017023
N  1.081392 -1.545611 -0.006161
N  0.517918 -2.844612 -0.063165
N  0.207173 0.783807 0.083582
N  -2.241642 0.879213 0.069337
C  -1.166584 -1.282656 -0.011148
C  0.080802 -0.577318 0.026931
C  -2.335308 -0.467895 0.014497
C  2.509512 -1.412112 0.010598
C  -0.823761 -2.669676 -0.06533
C  -4.773635 -0.203746 0.011199
C  -0.982301 1.437283 0.100811
C  -5.984582 -1.135942 -0.014693
C  0.865225 3.61803 0.199842
C  1.076627 5.140577 0.243701
C  3.112977 -0.130653 0.076404
C  3.307221 -2.582686 -0.039063
C  -7.304523 -0.332757 0.00787
C  4.520744 -0.033356 0.09182
C  4.711647 -2.463943 -0.022527
C  2.582547 5.489813 0.268973
C  5.328177 -1.192245 0.042748
H  -1.479676 -3.536185 -0.105373
H  -4.738652 0.469249 -0.864824
H  -4.736076 0.416802 0.924918
H  -5.937662 -1.76739 -0.921499
H  -5.937285 -1.816809 0.855572
H  1.302477 3.164312 -0.704794
H  1.286049 3.115118 1.086162
H  0.600693 5.610791 -0.638335
H  0.58192 5.562749 1.139643
H  2.483634 0.761135 0.114342
H  2.817992 -3.557612 -0.089147
H  -7.382612 0.338526 -0.867593
H  -8.174544 -1.012267 -0.010589
H  -7.382153 0.2894 0.918942
H  4.986452 0.957258 0.142863
H  5.325933 -3.370298 -0.060859
H  3.097237 5.102027 -0.629794
H  2.730608 6.584268 0.297946
H  3.078084 5.057291 1.158007
H  6.420073 -1.107057 0.05513
