program: Gaussian 09
title: 000223755
version: EM64L-G09RevD.01
frameworkgroup: C1[X(C19H16ClN5)]
method: RPBEPBE
basis: SDD
operation: Freq
keyword: #p
keyword: freq=noraman
keyword: PBEPBE/SDD
title: #p freq=noraman PBEPBE/SDD
converged: YES YES NO NO
title: Mulliken charges:
elementType: Cl N N N N N C C C C C C C C C C C C C C C C C C C H H H H H H H H H H H H H H H H
charge: -0.017318 -0.243563 -0.271472 -0.019100 -0.017596 0.030566 0.009112 0.214343 0.145186 -0.354993 0.388158 -0.373088 0.409819 -0.670644 -0.369296 -0.351351 -0.398290 -0.352051 -0.402181 -0.206767 -0.217524 -0.236705 -0.228290 -0.204754 -0.246263 0.221425 0.261085 0.284971 0.253153 0.220510 0.222205 0.255815 0.267878 0.316046 0.286825 0.235015 0.237188 0.237405 0.228338 0.227531 0.228674
chargesum: 0.00000
title: Mulliken charges with hydrogens summed into heavy atoms:
elementType: Cl N N N N N C C C C C C C C C C C C C C C C C C C
charge: -0.017318 -0.243563 -0.271472 -0.019100 -0.017596 0.030566 0.009112 0.214343 0.145186 0.127517 0.388158 -0.088117 0.409819 0.025225 -0.113482 -0.083474 -0.398290 -0.036004 -0.115356 0.028247 0.019664 0.000700 0.000048 0.022776 -0.017589
polarizability: 3.64363074e+02 -7.38367087e+00 2.93893113e+02 -1.17654513e+01 -5.09796809e-01 1.39044873e+02
1716.lowfreq: -5.9270 -1.5647 0.0009 0.0010 0.0013 4.4898 23.9512 31.4562 37.6573
frequency: 23.9074 31.4457 37.6372 41.6533 57.0525 59.9780 89.1473 101.0591 113.8608 162.9880 165.9993 205.8149 209.7099 221.3478 255.7297 270.4392 286.0851 302.9491 351.3238 357.9036 371.4122 407.5788 408.9333 410.4085 438.0965 481.7113 514.0349 530.7014 575.6946 608.4932 612.5835 616.2629 630.2208 657.1370 659.7734 667.6485 685.7941 701.3378 702.2440 742.8460 761.0264 771.1731 772.2677 777.9620 813.4672 840.6556 851.3580 860.4066 892.9680 920.8002 931.4559 941.8152 964.0998 978.9357 987.4655 989.6764 992.3234 999.1434 1005.5893 1013.4723 1022.6250 1030.8726 1039.6088 1076.8690 1084.2818 1095.6492 1110.1615 1144.3061 1151.5326 1171.7500 1173.8739 1180.2353 1190.2774 1221.5139 1252.1640 1269.0011 1300.6142 1307.7401 1309.7717 1329.5704 1354.6765 1370.0980 1374.7736 1383.0591 1385.1152 1394.7405 1411.4045 1435.1794 1443.1282 1447.5635 1467.3579 1468.7452 1484.3588 1487.6755 1490.0474 1518.1141 1559.5509 1590.2864 1596.3018 1607.0675 1613.0435 2987.8494 3021.5568 3078.7917 3093.0710 3108.9906 3130.0535 3133.0932 3138.9209 3142.5185 3150.3210 3158.4710 3161.2693 3172.1273 3179.8070 3188.6162 3240.3370
redmass: 4.6892 4.5181 4.1326 5.3523 3.3915 3.6014 4.8135 6.9948 7.7786 4.9658 5.6149 5.2554 7.5937 1.2989 3.8019 5.2993 6.4579 2.9162 3.8317 5.6803 12.6740 3.3876 5.1553 2.9852 4.8760 4.8469 3.3393 4.7987 5.0308 5.7199 6.4841 6.5652 7.3342 9.2947 6.4110 10.3472 7.4202 1.8569 2.0820 7.9981 1.7294 1.8082 1.7938 4.0132 2.4650 1.4555 1.2512 1.2456 5.0772 2.0531 1.9870 1.4057 4.8164 1.3825 6.2136 6.2089 1.3477 1.3206 1.3033 4.0497 2.2985 2.6762 2.9309 1.5633 2.1119 1.6739 2.7580 2.9359 3.4223 1.0563 1.0552 1.1157 1.1428 1.8842 2.4951 4.9613 1.6204 4.0654 1.3786 1.5022 1.3085 8.2748 8.2093 2.7564 1.7836 5.6079 4.4842 2.1907 1.6707 2.1707 1.4277 1.3960 1.0689 2.8271 2.8186 7.1205 8.9429 6.3938 6.8801 6.1830 5.9798 1.0354 1.0623 1.1002 1.0983 1.1037 1.0854 1.0852 1.0884 1.0909 1.0928 1.0971 1.0970 1.1018 1.0963 1.0954 1.0977
irintensity: 0.4212 0.8643 0.2339 0.1265 0.0104 0.8685 0.0249 1.2814 0.2000 1.6902 0.3486 0.4737 0.6857 0.0294 1.7831 0.7347 2.5383 0.7647 5.3664 0.9328 7.3706 0.2101 0.0433 0.0030 0.5515 6.1887 7.0861 7.0971 14.8199 6.3151 0.2276 0.7371 3.2769 1.0098 10.1890 7.6845 33.3439 56.8075 36.5024 11.0610 9.8630 46.6514 40.8531 39.3671 36.1818 7.5156 1.2042 0.0023 56.5153 13.8402 14.2346 9.8364 53.6903 0.0116 1.1149 1.8046 0.1786 0.0245 2.3155 15.8442 14.3227 7.0660 25.4305 11.3647 6.6099 31.0753 71.0864 124.9364 16.0896 0.1410 0.0505 3.2490 11.7459 35.0144 10.8983 32.7484 39.8183 164.3125 2.6047 49.8598 13.9842 333.1704 8.5564 26.7673 10.7507 106.9337 21.3362 5.7666 14.2771 66.1035 2.5287 23.7398 22.7261 87.6869 251.5684 221.3722 808.4575 9.5202 9.9743 9.9758 28.9566 27.0511 30.4651 18.6133 23.5179 22.9462 0.1859 2.0271 1.4573 23.4498 16.4062 19.0725 28.1276 14.6557 21.8421 5.5109 2.0999
temp: 298.150 k
press: 1.00000 atm
elementType: 17 7 7 7 7 7 6 6 6 6 6 6 6 6 6 6 6 6 6 6 6 6 6 6 6 1 1 1 1 1 1 1 1 1 1 1 1 1 1 1 1
symmnumber: 1
zpe: 821030.1 jmol-1
zpe.correction: 0.312714 hartree
zpe.thermalcorrener: 0.333641 hartree
zpe.thermalcorrenthalpy: 0.334585 hartree
zpe.thermalcorrgfe: 0.260532 hartree
zpe.sumelectzpe: -1465.697604 hartree
zpe.sumelectthermal: -1465.676676 hartree
zpe.sumelectthermalent: -1465.675732 hartree
zpe.sumelectthermalfe: -1465.749785 hartree
dipole: 4.8088 -3.3874 0.0405
dipole: 5.8822
quadrupole: -127.5625 -154.3214 -149.6497
quadrupole: -2.9855 -3.1386 -0.9671
quadrupole: 16.2820 -10.4769 -5.8051 -2.9855 -3.1386 -0.9671
hfenergy: -1466.0103174 hartree
pointgroup: C01 [X(C19H16Cl1N5)]
dipole: 1.8799414 1.349655 -0.0016802 debye
polarizability: 363.7085135|8.2617397|293.9855753|15.835874|-2.6388298|139.6069712 unknown
InChI: InChI=1S/C19H16ClN5/c1-2-24(14-9-5-3-6-10-14)17-16-13-21-25(15-11-7-4-8-12-15)18(16)23-19(20)22-17/h3-13H,2H2,1H3
charge 0 multiplicity 1
41 atoms
Cl -0.846911 -4.48121 0.098065
N  2.638231 -0.88198 0.376558
N  -1.893674 0.571772 0.052969
N  -1.113723 1.746011 0.136898
N  0.890566 -2.438497 0.216111
N  -1.475078 -1.870139 0.047046
C  0.275841 -0.095111 0.1791
C  1.286635 -1.118407 0.246394
C  -1.081849 -0.556545 0.081117
C  3.587584 -2.023814 0.543259
C  3.20682 0.43621 0.191435
C  0.173183 1.336644 0.213887
C  -3.322022 0.692849 -0.04563
C  4.076978 -2.588418 -0.804796
C  3.808315 1.100799 1.287205
C  3.202958 1.038588 -1.090588
C  -0.426694 -2.707543 0.125531
C  -4.142774 -0.460611 -0.123066
C  -3.89406 1.989566 -0.064816
C  4.399009 2.370658 1.100649
C  3.787123 2.312199 -1.269694
C  4.387163 2.980185 -0.176238
C  -5.541672 -0.3010 -0.221446
C  -5.293444 2.126787 -0.163491
C  -6.126045 0.985706 -0.242714
H  4.438324 -1.649158 1.140113
H  3.067334 -2.810174 1.112432
H  0.9572 2.08553 0.287791
H  3.229346 -3.008313 -1.372011
H  4.569075 -1.808538 -1.413498
H  4.808472 -3.398051 -0.628765
H  3.795996 0.629804 2.276199
H  2.741246 0.511873 -1.932489
H  -3.689142 -1.453735 -0.105498
H  -3.239374 2.86134 -0.002913
H  4.858361 2.886015 1.951024
H  3.77898 2.778119 -2.260876
H  4.841814 3.966511 -0.3178
H  -6.175068 -1.192906 -0.281365
H  -5.733444 3.130073 -0.178259
H  -7.212882 1.098712 -0.319327
