program: Gaussian 09
title: 000223858
version: EM64L-G09RevD.01
frameworkgroup: C1[X(C28H20O)]
method: RPBEPBE
basis: SDD
operation: Freq
keyword: #pfreq=noraman
keyword: PBEPBE/SDD
title: #p freq=noraman PBEPBE/SDD
converged: YES YES NO NO
title: Mulliken charges:
elementType: O C C C C C C C C C C C C C C C C C C C C C C C C C C C C H H H H H H H H H H H H H H H H H H H H
charge: -0.286778 0.080560 0.079876 0.113906 0.114036 0.268741 0.267386 0.286473 0.286326 -0.422118 -0.422301 -0.390538 -0.389984 -0.376637 -0.374173 -0.374925 -0.376642 -0.228413 -0.227938 -0.232725 -0.232203 -0.236483 -0.241773 -0.241027 -0.236482 -0.249027 -0.248810 -0.250451 -0.250598 0.259820 0.259645 0.252047 0.251848 0.257459 0.258951 0.259099 0.257715 0.228368 0.228404 0.227421 0.227479 0.226468 0.228299 0.228338 0.226415 0.228481 0.228502 0.229008 0.228954
chargesum: 0.00000
title: Mulliken charges with hydrogens summed into heavy atoms:
elementType: O C C C C C C C C C C C C C C C C C C C C C C C C C C C C
charge: -0.286778 0.080560 0.079876 0.113906 0.114036 0.268741 0.267386 0.286473 0.286326 -0.162299 -0.162656 -0.138490 -0.138136 -0.119179 -0.115222 -0.115826 -0.118927 -0.000045 0.000466 -0.005304 -0.004724 -0.010015 -0.013474 -0.012689 -0.010066 -0.020546 -0.020308 -0.021443 -0.021644
polarizability: 4.37375271e+02 3.08007124e-02 3.88995891e+02 8.75724060e+00 3.45733672e-01 1.73051823e+02
1716.lowfreq: -7.5463 -0.0007 -0.0004 -0.0001 3.8469 4.8928 26.8112 31.2591 35.7374
frequency: 26.7835 31.2335 35.7343 43.7729 47.8368 53.8327 57.8930 71.6986 78.1528 124.3610 135.2152 156.0383 218.0824 220.6691 235.2503 244.3732 248.1361 264.3327 280.5451 378.4670 389.7825 401.8843 402.5190 403.7335 405.9740 458.1012 470.4259 503.9185 505.6026 513.2891 538.1955 613.3595 613.9045 615.5544 615.8802 644.6238 653.6695 662.8429 666.1917 690.1464 698.4664 698.7841 704.5993 704.6222 715.1461 735.4991 767.5954 775.4933 778.0700 792.6945 851.4579 851.6447 857.9875 858.9547 920.4561 926.4617 926.8552 927.4209 929.2094 951.9896 979.3687 979.8533 981.8039 982.2352 986.5314 987.1459 988.9890 989.0873 996.1834 996.2579 997.1897 997.2988 1008.0251 1023.6109 1027.2634 1031.2211 1041.6580 1069.4567 1078.0844 1080.8282 1081.9730 1091.6377 1146.1015 1172.2642 1172.4012 1173.4332 1173.7437 1189.3479 1190.5536 1190.8447 1195.2990 1198.3858 1245.6548 1314.0869 1315.3714 1320.7754 1325.4668 1341.1612 1368.2620 1368.7756 1375.7314 1377.0609 1393.2945 1431.4502 1434.1539 1436.5068 1438.5315 1462.9152 1471.3419 1492.8666 1494.0871 1559.2161 1571.4473 1580.0426 1581.8590 1582.3497 1591.9651 1612.5618 1614.5198 1615.3158 1616.2733 3124.2813 3124.3759 3126.3226 3126.4034 3131.6440 3131.7911 3136.8179 3136.9447 3143.9573 3144.0444 3152.6159 3152.6469 3153.9092 3154.1483 3165.1226 3165.6016 3166.0168 3166.1520 3173.3090 3173.8834
redmass: 5.4898 3.6801 4.0135 4.5960 5.3176 4.8099 4.7069 4.3541 4.0192 5.1466 5.6683 4.8499 4.6181 6.5105 6.4698 5.2287 4.7076 5.0457 4.7532 5.4654 5.4819 2.8854 2.8643 2.8707 2.8614 5.1223 5.8465 4.5274 4.1499 4.5603 3.7157 6.4530 6.4484 6.2947 6.4171 6.3501 6.1370 6.6649 5.9950 6.8279 1.8052 1.7823 1.9649 1.8927 4.0303 2.9836 1.7990 1.9343 2.1673 2.6643 1.2487 1.2479 1.2452 1.2445 3.3343 1.4362 1.9020 1.4098 1.4315 7.6351 1.4371 1.3872 1.4361 1.3918 5.4097 5.9042 5.1328 6.2966 1.3158 1.3156 1.3077 1.3084 6.0760 2.6617 2.2441 2.0261 2.1455 3.0636 1.6980 1.6581 1.7139 1.9052 3.3906 1.0540 1.0533 1.0559 1.0593 1.3179 1.3648 1.1347 1.1244 1.8026 4.8147 1.4234 1.4000 1.4735 1.3829 3.0385 4.9321 6.1978 6.1480 6.3955 4.6814 2.2936 2.3462 2.3555 2.3940 2.2675 2.2160 2.6482 2.8140 7.4269 6.4383 5.9358 6.0896 6.1249 7.7447 5.9590 6.1355 6.4983 6.3412 1.0845 1.0846 1.0849 1.0849 1.0878 1.0878 1.0892 1.0892 1.0926 1.0927 1.0966 1.0967 1.0939 1.0940 1.0956 1.0958 1.1015 1.1015 1.0989 1.0986
irintensity: 0.0067 0.0454 0.3163 0.7491 1.1286 0.1704 0.0126 0.0159 0.0335 0.3345 0.9218 0.1243 0.2385 0.2482 0.0988 0.1243 0.0064 0.8437 0.0117 0.9015 0.6287 0.0198 0.5741 0.2168 0.1659 2.1572 0.0082 8.8440 1.2188 8.3532 1.6618 0.0732 0.2219 1.9558 0.2247 9.5122 14.9830 3.1416 15.9204 16.6742 16.8915 88.6066 26.9514 61.6725 0.9430 28.4839 41.8295 72.8550 2.0302 48.7814 0.8277 1.4320 0.3498 0.0101 35.7726 5.7050 1.9196 0.0152 3.6770 2.9653 0.6451 0.4061 0.9020 0.3686 0.0790 0.4740 0.5885 0.2358 0.3482 0.2229 0.0753 0.2671 2.6801 26.9479 9.3795 0.3061 4.0706 6.9683 5.7145 9.4545 3.6310 8.5457 0.6082 0.0063 0.0075 0.2317 0.0245 0.2866 0.1108 0.3392 2.4137 0.2421 0.1342 0.4798 1.2304 0.4531 0.6820 1.9826 2.7993 0.6895 2.6301 0.2368 6.8195 15.7924 1.2717 8.7457 2.2687 4.7928 52.0068 4.5879 39.6892 3.2639 0.6412 2.9841 0.1947 0.5379 2.2002 20.2745 2.6228 32.4791 7.8807 1.2580 2.1083 2.4409 1.0484 3.1616 0.2009 9.8262 13.2324 34.2460 13.4816 21.6467 45.6343 40.0856 22.6031 14.7061 15.6157 34.7852 14.0519 14.4834 10.1861
temp: 298.150 k
press: 1.00000 atm
elementType: 8 6 6 6 6 6 6 6 6 6 6 6 6 6 6 6 6 6 6 6 6 6 6 6 6 6 6 6 6 1 1 1 1 1 1 1 1 1 1 1 1 1 1 1 1 1 1 1 1
symmnumber: 1
zpe: 1014292.9 jmol-1
zpe.correction: 0.386324 hartree
zpe.thermalcorrener: 0.409288 hartree
zpe.thermalcorrenthalpy: 0.410232 hartree
zpe.thermalcorrgfe: 0.331628 hartree
zpe.sumelectzpe: -1152.264506 hartree
zpe.sumelectthermal: -1152.241541 hartree
zpe.sumelectthermalent: -1152.240597 hartree
zpe.sumelectthermalfe: -1152.319201 hartree
dipole: 0.0002 1.2084 -0.0113
dipole: 1.2084
quadrupole: -147.8172 -149.0555 -168.0497
quadrupole: 0.1431 2.8677 0.0963
quadrupole: 7.1570 5.9186 -13.0756 0.1431 2.8677 0.0963
hfenergy: -1152.6508293 hartree
pointgroup: C01 [X(C28H20O1)]
dipole: 0.0006694 0.4709106 -0.0653755 debye
polarizability: 434.6926175|3.987804|384.2848355|27.6147965|-31.3482681|180.4455315 unknown
InChI: InChI=1S/C28H20O/c1-5-13-21(14-6-1)25-26(22-15-7-2-8-16-22)28(24-19-11-4-12-20-24)29-27(25)23-17-9-3-10-18-23/h1-20H
charge 0 multiplicity 1
49 atoms
O  -0.000564 -1.825247 0.277408
C  0.728297 0.326157 0.017079
C  -0.727297 0.309492 -0.098645
C  1.141843 -0.994958 0.231951
C  -1.142271 -1.016609 0.079539
C  1.589807 1.534437 -0.052814
C  -1.587826 1.488275 -0.377498
C  2.424845 -1.690564 0.369642
C  -2.426253 -1.720077 0.152497
C  2.500536 1.832675 0.997708
C  -2.487777 1.480794 -1.478282
C  1.506725 2.429043 -1.153758
C  -1.514028 2.653959 0.431622
C  2.465549 -2.979157 0.977997
C  -3.641639 -1.034331 0.438298
C  3.639764 -1.127446 -0.115812
C  -2.468304 -3.132633 -0.036021
C  3.313175 2.985414 0.943666
C  -3.299381 2.602039 -1.75496
C  2.318601 3.583128 -1.207265
C  -2.325261 3.776128 0.154452
C  3.684601 -3.674409 1.107362
C  -4.859327 -1.740282 0.516006
C  4.856245 -1.826857 0.020471
C  -3.68876 -3.832415 0.046818
C  3.226164 3.866373 -0.160236
C  -3.222513 3.75522 -0.938648
C  4.888621 -3.101631 0.633788
C  -4.892986 -3.141077 0.31894
H  2.566441 1.155944 1.857019
H  -2.546789 0.590926 -2.114988
H  0.807462 2.214373 -1.968933
H  -0.821714 2.675531 1.280018
H  1.535361 -3.422561 1.34641
H  -3.630817 0.045187 0.611637
H  3.629216 -0.15169 -0.609314
H  -1.5379 -3.668341 -0.247833
H  4.008779 3.198168 1.763267
H  -3.986973 2.577276 -2.607898
H  2.242098 4.259845 -2.065666
H  -2.256579 4.664938 0.791582
H  3.696653 -4.662836 1.580257
H  -5.783413 -1.195915 0.740334
H  5.780131 -1.378887 -0.362124
H  -3.701675 -4.917793 -0.103432
H  3.854831 4.762918 -0.202007
H  -3.851242 4.626547 -1.153665
H  5.836218 -3.64189 0.736207
H  -5.841574 -3.685682 0.381421
