program: Gaussian 09
title: 000223802
version: EM64L-G09RevD.01
frameworkgroup: C1[X(C12H18N2O8S)]
method: RPBEPBE
basis: SDD
operation: Freq
keyword: #p
keyword: freq=noraman
keyword: PBEPBE/SDD
title: #p freq=noraman PBEPBE/SDD
converged: YES YES NO NO
title: Mulliken charges:
elementType: S O O O O O O O O N N C C C C C C C C C C C C H H H H H H H H H H H H H H H H H H
charge: 0.946123 -0.544342 -0.487849 -0.501382 -0.522673 -0.456324 -0.320377 -0.542167 -0.537745 -0.434125 -0.717143 -0.044364 -0.165347 -0.181554 -0.229072 -0.297906 0.195661 0.501712 -0.430420 -0.318559 -0.061811 -0.203566 -0.225483 0.254705 0.250043 0.259318 0.288479 0.190650 0.197139 0.405627 0.400926 0.389015 0.365217 0.413243 0.246776 0.317994 0.362265 0.283984 0.283606 0.336840 0.332885
chargesum: 0.00000
title: Mulliken charges with hydrogens summed into heavy atoms:
elementType: S O O O O O O O O N N C C C C C C C C C C C C
charge: 0.946123 -0.138715 -0.086923 -0.136165 -0.109429 -0.094059 -0.320377 -0.542167 -0.537745 -0.045110 -0.047418 0.210341 0.084696 0.077764 0.059407 0.089884 0.195661 0.501712 -0.183645 -0.000565 -0.061811 0.080418 0.058123
polarizability: 3.23787371e+02 -5.25686756e+00 1.81490114e+02 -4.29390551e+00 -1.00721239e+01 1.30610053e+02
1716.lowfreq: -14.5920 -5.1872 -0.0015 -0.0005 0.0017 3.1715 12.4223 18.7805 34.9964
frequency: 11.2408 18.4068 34.8635 43.2510 55.3964 62.0753 76.8097 90.3272 107.7069 122.3210 128.1185 143.7555 154.4206 199.9259 212.1968 231.8267 240.0731 262.4716 269.5963 274.8459 285.8087 295.4791 315.1752 336.6176 340.3932 351.6982 373.9544 387.3833 393.9697 414.7865 429.5155 445.5318 472.8995 479.9181 526.6328 542.3569 558.5504 565.1751 597.4032 619.5992 643.6348 657.9695 675.0099 734.2731 737.2582 763.7041 782.4896 795.7629 807.8669 818.0788 833.1298 839.7049 866.3791 874.3387 908.1858 937.4694 940.4345 960.5879 969.7388 971.4834 991.3099 995.2955 1000.6559 1004.0370 1040.5074 1052.9741 1056.4895 1071.1998 1092.2814 1097.7708 1123.5463 1177.5743 1184.3492 1197.4665 1200.7899 1227.8829 1263.3736 1269.3079 1273.8105 1280.9935 1295.6754 1300.5328 1325.2063 1331.0649 1354.8587 1378.0512 1385.8609 1396.7411 1408.2604 1424.3107 1445.7091 1463.2654 1477.6138 1485.8062 1533.9056 1541.9425 1592.7537 1601.4497 1606.0199 2952.8394 2966.0091 2989.7295 2998.2956 3006.9970 3026.2104 3133.9967 3137.7745 3159.8021 3168.1930 3187.1058 3195.5086 3214.2325 3363.5327 3367.9522 3477.9671 3531.0397 3603.5151
redmass: 6.3700 7.4632 5.6070 3.9959 5.3746 7.1873 9.1053 6.1278 1.7082 5.7762 7.1042 7.9952 3.7335 6.1014 6.0369 4.5459 5.7618 3.8260 2.0889 2.4757 2.3958 7.7576 4.5999 5.7541 7.5195 5.1435 5.4025 5.4249 5.6393 2.9885 7.4878 5.3380 4.0134 5.8317 5.2573 3.1587 2.0740 2.1723 3.0601 7.0847 5.5763 1.5209 1.7431 1.3208 2.7629 3.0872 2.7590 2.7837 2.6859 1.5091 1.2566 2.6448 1.3590 1.5267 4.0667 2.9637 4.4794 4.2105 1.5002 4.6597 5.1990 5.1709 1.3521 5.6182 2.6890 2.9945 2.4202 1.4874 2.5078 2.9267 1.3077 1.2518 1.1234 1.5278 1.6754 1.1720 1.5844 1.1344 1.2427 1.1673 1.1960 1.3358 1.2493 1.2088 1.2826 1.5526 3.3040 1.7473 3.7582 1.5489 1.4396 1.1304 2.3661 1.1163 1.0871 2.3776 4.9398 4.9177 6.8326 1.0597 1.0815 1.0845 1.1019 1.0866 1.0889 1.0679 1.0900 1.0912 1.0959 1.0667 1.0954 1.0677 1.0414 1.0764 1.0647 1.1000 1.0669
irintensity: 0.5052 0.0999 0.5668 1.7333 3.3660 6.7685 6.7707 4.5181 31.0083 11.2123 4.7601 4.8277 8.0193 9.5407 14.0145 9.1270 31.1045 8.5512 36.2589 35.3359 93.7375 10.5558 28.9320 13.4945 31.7374 3.2524 21.5455 5.1177 51.1232 0.1580 15.8041 20.3218 104.6997 44.7815 72.3934 73.8041 56.2895 59.3316 33.7079 1.2994 16.4266 32.9241 118.2337 126.6584 26.8666 62.7581 11.9173 25.0556 216.5699 41.9099 295.5046 6.2815 12.2217 146.3477 59.2532 44.3890 33.0401 6.3455 9.4133 50.1710 1.7213 38.9769 1.8061 55.3802 10.8547 74.1235 41.9885 25.3944 2.3047 8.2353 6.2838 61.3751 12.1922 3.5123 36.6774 11.0133 55.9259 38.8844 44.4608 18.2024 15.9170 6.2955 3.0958 78.4340 14.7030 58.4188 178.4609 10.2158 94.5737 200.7047 91.2623 78.9025 18.8388 7.6908 9.9311 666.5232 200.5201 72.3941 26.0461 87.3557 8.0498 17.0927 62.8191 48.5162 49.2082 681.1733 4.9367 2.6063 5.6470 736.1609 4.2133 230.0310 29.7794 143.5484 83.3085 24.3432 16.5095
temp: 298.150 k
press: 1.00000 atm
elementType: 16 8 8 8 8 8 8 8 8 7 7 6 6 6 6 6 6 6 6 6 6 6 6 1 1 1 1 1 1 1 1 1 1 1 1 1 1 1 1 1 1
symmnumber: 1
zpe: 809999.4 jmol-1
zpe.correction: 0.308512 hartree
zpe.thermalcorrener: 0.332808 hartree
zpe.thermalcorrenthalpy: 0.333752 hartree
zpe.thermalcorrgfe: 0.252057 hartree
zpe.sumelectzpe: -1575.471906 hartree
zpe.sumelectthermal: -1575.447611 hartree
zpe.sumelectthermalent: -1575.446667 hartree
zpe.sumelectthermalfe: -1575.528361 hartree
dipole: 6.2123 3.5537 3.4881
dipole: 7.9617
quadrupole: -131.1671 -149.3925 -149.4183
quadrupole: 0.9966 -21.5180 -6.6870
quadrupole: 12.1588 -6.0665 -6.0923 0.9966 -21.5180 -6.6870
hfenergy: -1575.7804186 hartree
pointgroup: C01 [X(C12H18N2O8S1)]
dipole: 2.5567414 -1.809407 0.0282075 debye
polarizability: 315.2485374|6.9446379|133.7656914|-33.4351838|-17.3513076|186.8733084 unknown
InChI: InChI=1S/C12H18N2O8S/c13-23(21,22)7-3-1-6(2-4-7)14-12(20)11(19)10(18)9(17)8(16)5-15/h1-4,8-11,14-19H,5,13H2
charge 0 multiplicity 1
41 atoms
S  -6.240205 0.225531 1.53681
O  4.570214 -0.980482 0.565298
O  2.632644 0.185861 -2.352935
O  6.579454 -0.13706 -0.836306
O  2.2361 -0.317686 1.381648
O  3.933501 2.453938 -1.57877
O  0.168977 0.604366 -1.438194
O  -6.532958 0.462918 3.122144
O  -6.871791 1.150614 0.353874
N  -0.207606 0.140787 0.847066
N  -6.755526 -1.511589 1.194604
C  4.321638 -0.748211 -0.872938
C  2.801115 -0.514522 -1.066397
C  5.284253 0.365134 -1.366275
C  2.09198 0.299933 0.068853
C  5.016762 1.79765 -0.85452
C  0.584651 0.370104 -0.247609
C  -1.619624 0.164068 0.952846
C  -2.181698 -0.133065 2.225668
C  -2.46288 0.485878 -0.146549
C  -4.379961 0.186824 1.297532
C  -3.576383 -0.124973 2.406307
C  -3.860717 0.497635 0.031576
H  4.598589 -1.667061 -1.426177
H  2.312169 -1.508186 -1.117568
H  5.288314 0.36675 -2.473594
H  2.484405 1.339334 0.059318
H  5.928859 2.408435 -1.012413
H  4.81167 1.775071 0.236875
H  5.558745 -0.94389 0.681479
H  1.636417 0.368828 -2.427976
H  0.354821 -0.117495 1.676186
H  7.317243 0.462738 -1.104303
H  3.196747 -0.630824 1.439515
H  -1.525846 -0.36585 3.072344
H  -2.01774 0.720352 -1.114975
H  3.389359 1.748007 -2.053449
H  -4.028524 -0.329049 3.381565
H  -4.531144 0.76651 -0.790819
H  -7.264553 -1.854444 2.026799
H  -7.332973 -1.512276 0.337057
