program: Gaussian 09
title: 000223759
version: EM64L-G09RevD.01
frameworkgroup: C1[X(C19H28Cl2)]
method: RPBEPBE
basis: SDD
operation: Freq
keyword: #p
keyword: freq=noraman
keyword: PBEPBE/SDD
title: #p freq=noraman PBEPBE/SDD
converged: YES YES NO NO
title: Mulliken charges:
elementType: Cl Cl C C C C C C C C C C C C C C C C C C C H H H H H H H H H H H H H H H H H H H H H H H H H H H H
charge: -0.083826 -0.084726 -0.128460 0.487332 -0.187439 -0.088553 0.269096 -0.519886 -0.542010 -0.541031 -0.551636 -0.495603 -0.394305 0.472176 -0.516799 -0.807908 -0.475427 -0.825968 -0.587468 -0.387397 -0.383745 0.204085 0.249743 0.193977 0.194506 0.224697 0.229644 0.215322 0.213393 0.236601 0.283237 0.222953 0.214207 0.246984 0.219934 0.210570 0.221653 0.230709 0.241326 0.224265 0.213557 0.226719 0.224944 0.226343 0.240394 0.234750 0.225922 0.229636 0.273512
chargesum: 0.00000
title: Mulliken charges with hydrogens summed into heavy atoms:
elementType: Cl Cl C C C C C C C C C C C C C C C C C C C
charge: -0.083826 -0.084726 0.075625 0.487332 0.062304 0.105424 0.269096 -0.100683 -0.097044 -0.091037 -0.268399 -0.058443 0.072613 0.472176 -0.084577 -0.111607 -0.261870 -0.147963 -0.112325 0.068161 -0.110233
polarizability: 2.85428457e+02 -2.29967959e+00 1.99028671e+02 2.78191446e+00 -3.01773879e+00 1.56589786e+02
1716.lowfreq: -8.5992 -0.0007 -0.0004 0.0014 5.8386 13.2089 33.9243 53.8036 73.3647
frequency: 33.4153 53.7857 73.3500 92.6330 102.0859 123.2987 158.4524 173.4408 183.8433 195.1731 218.8607 226.2697 231.0640 244.8794 262.1132 275.2416 291.3418 294.3457 309.7555 324.2947 348.1553 365.8327 391.6165 417.1605 431.3667 439.4729 451.7865 457.7020 501.5153 532.7138 558.5561 582.3229 591.0608 608.6747 672.5642 687.8668 700.2509 736.4234 774.6703 798.9868 816.5077 826.2298 836.4177 850.6139 864.7497 884.8211 908.8018 913.4298 937.4188 941.7344 956.2195 961.7129 986.7544 988.7393 1008.3271 1012.6096 1020.4174 1024.0688 1038.2532 1047.1850 1072.7340 1073.5002 1089.5103 1113.1144 1120.1461 1122.7725 1132.6590 1138.5171 1142.8082 1154.1014 1167.4541 1182.9303 1187.9515 1195.8769 1203.8271 1212.4419 1219.1626 1237.1351 1244.1526 1248.2460 1260.8350 1264.3234 1273.6200 1283.9438 1287.9005 1295.0233 1296.8226 1302.8746 1321.9978 1324.3283 1328.6700 1333.7518 1340.4054 1342.8641 1346.0280 1353.5272 1360.8811 1366.4778 1386.3931 1397.2685 1455.6135 1459.3390 1460.8233 1462.8110 1467.4092 1470.1994 1476.2619 1479.0340 1486.2042 1488.7346 1490.6862 1496.5047 1681.4503 2906.8791 2920.4930 2930.6767 2958.9207 2966.5021 2973.7291 2980.9987 2983.8971 2992.0252 2997.3036 2999.6034 3002.9958 3005.0349 3025.7566 3027.2833 3038.1528 3046.7049 3049.2304 3049.8303 3056.8326 3060.8682 3072.8118 3075.8126 3081.7205 3087.1234 3087.1839 3091.7260 3099.9697
redmass: 7.1046 3.4745 5.9366 6.3146 3.4217 1.7678 5.7467 1.6820 3.5566 1.5756 1.9517 2.4447 2.9065 2.3667 2.9682 2.2169 2.5627 3.1484 2.4430 3.9487 2.5138 3.1473 2.9469 3.1654 3.5646 2.5272 2.6267 3.6384 2.5635 2.8908 3.3525 3.3719 2.5992 3.8750 2.9830 3.6687 3.2694 2.4381 3.1995 1.8515 1.8601 1.7542 1.7318 1.9308 2.2834 1.6475 1.7527 1.9634 1.8715 2.4275 1.7916 1.9756 2.2274 2.1423 2.0773 2.1642 1.8866 1.8590 1.9987 2.1558 2.7760 2.4204 1.6398 1.8277 1.6736 2.3353 2.3202 2.1383 1.5116 1.8822 1.7373 1.4428 2.0113 1.6815 1.4122 1.4535 1.4333 1.4434 1.3612 1.3736 1.3474 1.4118 1.4468 1.3826 1.4478 1.4084 1.3365 1.5611 1.4282 1.4179 1.3810 1.3977 1.4568 1.4755 1.5642 1.3795 1.4985 1.4802 1.2217 1.2049 1.0888 1.0730 1.0709 1.0834 1.0824 1.0766 1.0753 1.0815 1.0763 1.0561 1.0750 1.0631 7.7669 1.0802 1.0813 1.0662 1.0625 1.0625 1.0819 1.0453 1.0553 1.0608 1.0713 1.0452 1.0730 1.0623 1.0911 1.0680 1.0964 1.0900 1.0913 1.0975 1.1022 1.1000 1.0989 1.0977 1.0977 1.0909 1.0991 1.1025 1.0974
irintensity: 1.1333 0.4705 0.5209 1.0366 0.5377 0.2448 0.5201 0.2474 0.7441 0.1345 1.1067 1.3747 2.4616 0.4257 2.4406 1.5403 2.1372 3.7648 1.0671 6.6237 0.5355 1.3123 0.8660 4.4431 1.3131 0.7985 0.4528 0.8076 0.2887 1.1812 7.2382 3.1445 5.3574 8.5843 3.5297 43.9482 16.2689 8.8189 23.6229 6.5203 28.2931 10.7707 3.2933 12.4267 22.5407 1.2528 11.2631 0.9294 4.8648 2.2376 4.4208 9.7328 8.3838 2.3955 1.3010 10.5609 4.3025 11.6329 6.4594 6.9639 2.3588 2.1966 2.2986 6.0264 1.8425 1.5336 3.4546 9.5914 2.4922 11.1032 1.9212 3.8128 6.9741 1.3215 3.3879 0.7867 1.8012 1.5775 2.3041 7.5424 0.4416 3.0858 6.2840 2.7563 7.1295 5.6344 1.4901 3.5083 7.6893 3.4325 2.2013 0.6787 0.1577 1.0361 0.7199 0.4155 7.8752 2.0919 13.8502 28.3807 8.1880 3.2235 1.5718 14.2823 10.7467 6.8487 3.9901 4.6130 30.1412 0.8023 12.1031 9.7562 3.9313 12.2708 16.9732 36.0176 38.3721 24.3672 20.3442 10.6945 24.2279 29.6170 14.6903 10.4854 61.4125 13.9616 32.6628 21.3465 51.1717 3.5503 8.9812 48.0451 13.7895 15.4783 26.1256 48.2234 40.0359 32.8944 44.2006 32.6060 29.1003
temp: 298.150 k
press: 1.00000 atm
elementType: 17 17 6 6 6 6 6 6 6 6 6 6 6 6 6 6 6 6 6 6 6 1 1 1 1 1 1 1 1 1 1 1 1 1 1 1 1 1 1 1 1 1 1 1 1 1 1 1 1
symmnumber: 1
zpe: 1120981.5 jmol-1
zpe.correction: 0.426959 hartree
zpe.thermalcorrener: 0.447209 hartree
zpe.thermalcorrenthalpy: 0.448153 hartree
zpe.thermalcorrgfe: 0.379440 hartree
zpe.sumelectzpe: -1659.321004 hartree
zpe.sumelectthermal: -1659.300754 hartree
zpe.sumelectthermalent: -1659.299810 hartree
zpe.sumelectthermalfe: -1659.368523 hartree
dipole: -0.8341 1.2108 -0.6005
dipole: 1.5882
quadrupole: -189.0585 -138.5765 -139.6031
quadrupole: -8.8430 -0.1006 -0.7911
quadrupole: -33.3125 17.1696 16.1429 -8.8430 -0.1006 -0.7911
hfenergy: -1659.7479628 hartree
pointgroup: C01 [X(C19H28Cl2)]
dipole: -0.341107 0.4650192 -0.2404902 debye
polarizability: 285.4957927|0.0507219|198.9052188|2.7190446|-3.360178|156.6459021 unknown
InChI: InChI=1S/C19H28Cl2/c1-18-9-7-13(20)11-12(18)3-4-14-15-5-6-17(21)19(15,2)10-8-16(14)18/h3,13-17H,4-11H2,1-2H3
charge 0 multiplicity 1
49 atoms
Cl -5.637274 -1.303072 -0.140376
Cl 6.400916 0.006481 -0.130988
C  -2.068892 0.788413 -0.323235
C  -2.836598 -0.52896 0.031198
C  -0.621885 0.823514 0.206498
C  0.165469 -0.416787 -0.328041
C  1.633659 -0.477882 0.247084
C  -2.084567 -1.705025 -0.629126
C  -0.61156 -1.754749 -0.142442
C  -3.051099 1.927745 0.069446
C  -4.193357 -0.154309 -0.613684
C  0.088901 2.124387 -0.234572
C  -4.472968 1.316035 -0.198488
C  2.292746 0.914828 0.167142
C  2.471526 -1.465499 -0.637828
C  -2.993977 -0.749514 1.557463
C  1.590847 2.056387 -0.068601
C  1.64887 -0.959381 1.732269
C  3.80619 0.977083 0.383684
C  3.994395 -1.44625 -0.349277
C  4.5264 -0.023981 -0.530764
H  -1.986296 0.801733 -1.436151
H  -0.637099 0.799451 1.315607
H  0.270748 -0.251778 -1.425891
H  -2.10906 -1.578177 -1.732293
H  -2.584915 -2.666848 -0.403848
H  -0.603078 -2.048235 0.923205
H  -0.087208 -2.562552 -0.687767
H  -2.879292 2.845569 -0.519355
H  -2.934075 2.197412 1.135554
H  -4.147357 -0.274381 -1.709614
H  -0.308728 2.986848 0.337447
H  -0.154633 2.336704 -1.300129
H  -5.100671 1.340023 0.708266
H  -5.023978 1.851579 -0.990316
H  2.307201 -1.206703 -1.704504
H  2.099047 -2.497334 -0.496811
H  -3.541266 0.077309 2.042646
H  -3.564705 -1.676059 1.743199
H  -2.01686 -0.843631 2.05929
H  2.13844 3.008314 -0.139129
H  0.930526 -0.381987 2.341619
H  1.389382 -2.030646 1.813989
H  2.643544 -0.829386 2.19218
H  4.17615 2.00083 0.199329
H  4.063306 0.725241 1.431871
H  4.202272 -1.783604 0.683187
H  4.518072 -2.141296 -1.030223
H  4.488893 0.29194 -1.586919
